program: Gaussian 16
title: 2F_isomer_13 opt
version: ES64L-G16RevC.02
basis: CBSB1
frameworkgroup: C1[X(C10H6F2)]
method: RHF
basis: STO-3G
operation: FOpt
keyword: #P
keyword: opt
keyword: EmpiricalDispersion=GD3BJ
keyword: integral(grid=ultrafinegrid)
keyword: GFInput
keyword: pop=full
keyword: IOP(3/74=-78)
keyword: IOP(6/7=3)
keyword: IOP(3/5=10)
keyword: IOP(3/175=01217700)
keyword: IOP(3/177=414500)
keyword: IOP(3/178=4859300)
keyword: SCF=YQC
title: #P opt EmpiricalDispersion=GD3BJ integral(grid=ultrafinegrid) GFInput
nucrepener: 647.3086241082
basis: NPDir=0 NMtPBC= 1 NCelOv= 1 NCel= 1 NClECP= 1 NCelD= 1
basis: NCelK= 1 NCelE2= 1 NClLst= 1 CellRange= 0.0.
basis: One-electron integrals computed using PRISM.
basis: One-electron integral symmetry used in STVInt
basis: NBasis= 444 RedAO= T EigKep= 1.44D-06 NBF= 444
basis: NBsUse= 442 1.00D-06 EigRej= 5.65D-07 NBFU= 442
converged: YES YES YES YES
title: Mulliken charges:
elementType: C C C C C C C C C C F F H H H H H H
charge: -0.014783 -0.014781 -0.362765 0.097126 -0.362765 0.097126 0.152438 -0.026254 0.152439 -0.026254 -0.242289 -0.242289 0.127288 0.127288 0.149728 0.119510 0.149729 0.119510
chargesum: 0.00000
charge: -0.051735 -0.051735 -0.336959 0.083969 -0.336959 0.083969 0.138363 0.009800 0.138363 0.009800 -0.234076 -0.234076 0.125341 0.125341 0.148000 0.117296 0.148000 0.117296
chargesum: -0.00000
dipole: 0.5644 -0.0000 -0.0000
dipole: 0.5644
quadrupole: -55.0898 -70.0074 -70.7552
quadrupole: 0.0000 -0.0000 -0.0000
quadrupole: 10.1943 -4.7233 -5.4710 0.0000 -0.0000 -0.0000
hfenergy: -583.612773 hartree
pointgroup: C01 [X(C10H6F2)]
dipole: 0.2217188 0.0014866 -0.0118152 debye
InChI: InChI=1/10C.2F.6H
charge 0 multiplicity 1
18 atoms
C  -0.00407021 0.69736269 -0.10653719
C  0.01659923 -0.69727877 0.10586917
C  -1.21243197 -1.35770671 0.27119906
C  1.21047769 1.38538783 -0.27533386
C  -1.25243117 1.34118105 -0.1398471
C  1.25129763 -1.36888301 0.14414584
C  -2.39819044 -0.7101391 0.23404419
C  2.38966412 0.70997462 -0.23357267
C  -2.41876125 0.67784407 0.02265113
C  2.41023167 -0.67779393 -0.02221348
F  -1.18579902 -2.66913613 0.47055513
F  -1.26467187 2.65270707 -0.33996936
H  1.18776256 2.45066064 -0.43721445
H  1.26015986 -2.43424862 0.30676511
H  -3.31312267 -1.26390725 0.3666306
H  3.31851263 1.24313596 -0.36373169
H  -3.34992437 1.21923522 -0.01155658
H  3.35469759 -1.19839563 0.00811713
