program: Gaussian 16
title: 2F_isomer_5 opt
version: ES64L-G16RevC.02
basis: CBSB1
frameworkgroup: C1[X(C10H6F2)]
method: RHF
basis: STO-3G
operation: FOpt
keyword: #P
keyword: opt
keyword: EmpiricalDispersion=GD3BJ
keyword: integral(grid=ultrafinegrid)
keyword: GFInput
keyword: pop=full
keyword: IOP(3/74=-78)
keyword: IOP(6/7=3)
keyword: IOP(3/5=10)
keyword: IOP(3/175=01217700)
keyword: IOP(3/177=414500)
keyword: IOP(3/178=4859300)
keyword: SCF=YQC
title: #P opt EmpiricalDispersion=GD3BJ integral(grid=ultrafinegrid) GFInput
nucrepener: 640.8119551575
basis: NPDir=0 NMtPBC= 1 NCelOv= 1 NCel= 1 NClECP= 1 NCelD= 1
basis: NCelK= 1 NCelE2= 1 NClLst= 1 CellRange= 0.0.
basis: One-electron integrals computed using PRISM.
basis: One-electron integral symmetry used in STVInt
basis: NBasis= 444 RedAO= T EigKep= 1.51D-06 NBF= 444
basis: NBsUse= 442 1.00D-06 EigRej= 6.25D-07 NBFU= 442
converged: YES YES YES YES
title: Mulliken charges:
elementType: C C C C C C C C C C F F H H H H H H
charge: 0.347679 -0.043609 -0.432702 -0.011812 -0.234136 -0.200448 -0.225956 -0.066707 0.581022 -0.017637 -0.233266 -0.218434 0.118980 0.123809 0.097040 0.117470 0.175416 0.123291
chargesum: 0.00000
charge: 0.233026 0.028480 -0.517956 0.010150 -0.163721 -0.189355 -0.211378 -0.032262 0.537381 -0.018137 -0.216522 -0.202140 0.118184 0.123612 0.090341 0.114552 0.173816 0.121930
chargesum: -0.00000
dipole: -1.5977 -0.6925 -0.0000
dipole: 1.7413
quadrupole: -63.2504 -63.8424 -70.7944
quadrupole: 2.8669 -0.0000 0.0000
quadrupole: 2.7120 2.1200 -4.8320 2.8669 -0.0000 0.0000
hfenergy: -583.613979 hartree
pointgroup: C01 [X(C10H6F2)]
dipole: -0.667417 -0.1537196 0.0166414 debye
InChI: InChI=1/10C.2F.6H
charge 0 multiplicity 1
18 atoms
C  0.03269881 0.69216976 0.05184041
C  -0.06531743 -0.71182903 -0.05196102
C  1.10193579 -1.49206889 -0.16175051
C  -1.13059659 1.47430112 0.16160639
C  1.32071276 1.25376685 0.04010188
C  -1.34883105 -1.29060817 -0.04173558
C  2.30435979 -0.87448954 -0.16553386
C  -2.35305284 0.88041038 0.1680655
C  2.44752778 0.51266489 -0.06495308
C  -2.4605973 -0.51574102 0.06527403
F  1.42264615 2.56896997 0.13690635
F  3.41417348 -1.58879462 -0.26780175
H  1.04378034 -2.56548301 -0.24182645
H  -1.03477356 2.54507182 0.23987273
H  -1.43489936 -2.36381391 -0.12060536
H  -3.24529651 1.48062843 0.25228066
H  3.42231865 0.97044333 -0.0713183
H  -3.43678893 -0.97559835 0.07153894
