program: Gaussian 16
title: 2F_isomer_7 opt
version: ES64L-G16RevC.02
basis: CBSB1
frameworkgroup: C1[X(C10H6F2)]
method: RHF
basis: STO-3G
operation: FOpt
keyword: #P
keyword: opt
keyword: EmpiricalDispersion=GD3BJ
keyword: integral(grid=ultrafinegrid)
keyword: GFInput
keyword: pop=full
keyword: IOP(3/74=-78)
keyword: IOP(6/7=3)
keyword: IOP(3/5=10)
keyword: IOP(3/175=01217700)
keyword: IOP(3/177=414500)
keyword: IOP(3/178=4859300)
keyword: SCF=YQC
title: #P opt EmpiricalDispersion=GD3BJ integral(grid=ultrafinegrid) GFInput
nucrepener: 630.6982323055
basis: NPDir=0 NMtPBC= 1 NCelOv= 1 NCel= 1 NClECP= 1 NCelD= 1
basis: NCelK= 1 NCelE2= 1 NClLst= 1 CellRange= 0.0.
basis: One-electron integrals computed using PRISM.
basis: One-electron integral symmetry used in STVInt
basis: NBasis= 444 RedAO= T EigKep= 1.59D-06 NBF= 444
basis: NBsUse= 442 1.00D-06 EigRej= 6.69D-07 NBFU= 442
converged: YES YES YES YES
title: Mulliken charges:
elementType: C C C C C C C C C C F F H H H H H H
charge: 0.328928 0.328929 -0.270964 -0.270964 -0.309375 -0.309375 -0.215871 -0.215871 0.320166 0.320165 -0.223728 -0.223728 0.120498 0.120498 0.100385 0.100385 0.149961 0.149961
chargesum: 0.00000
charge: 0.322685 0.322685 -0.326568 -0.326568 -0.261457 -0.261457 -0.188833 -0.188833 0.305101 0.305101 -0.212331 -0.212331 0.118780 0.118780 0.094428 0.094428 0.148194 0.148194
chargesum: -0.00000
dipole: 0.0000 -0.0000 -0.0000
dipole: 0.0000
quadrupole: -76.1054 -56.4301 -70.7348
quadrupole: 4.5266 0.0000 0.0000
quadrupole: -8.3486 11.3267 -2.9781 4.5266 0.0000 0.0000
hfenergy: -583.614434 hartree
pointgroup: C01 [X(C10H6F2)]
dipole: 0. 0. 0. debye
InChI: InChI=1/10C.2F.6H
charge 0 multiplicity 1
18 atoms
C  0.12511326 0.69251241 -0.06069148
C  -0.12511337 -0.6925123 0.06069155
C  0.95829781 -1.58969764 0.1085626
C  -0.95829792 1.58969775 -0.10856251
C  1.45934436 1.13717238 -0.13062656
C  -1.45934447 -1.13717228 0.13062667
C  2.21912079 -1.1068928 0.03726751
C  -2.2191209 1.10689291 -0.03726746
C  -2.49372138 -0.25838708 0.08307526
C  2.49372127 0.25838719 -0.08307518
F  3.24844039 -1.94168938 0.08128492
F  -3.24844049 1.9416895 -0.08128468
H  -0.79086937 2.6513103 -0.20099992
H  0.79086923 -2.65131018 0.20100003
H  -1.65387308 -2.19502445 0.22342082
H  1.65387297 2.19502456 -0.22342071
H  3.51980786 0.58491183 -0.13557439
H  -3.51980796 -0.58491171 0.13557452
