program: Gaussian 16
title: 3F_isomer_15 opt
version: ES64L-G16RevC.02
basis: CBSB1
frameworkgroup: C1[X(C10H5F3)]
method: RHF
basis: STO-3G
operation: FOpt
keyword: #P
keyword: opt
keyword: EmpiricalDispersion=GD3BJ
keyword: integral(grid=ultrafinegrid)
keyword: GFInput
keyword: pop=full
keyword: IOP(3/74=-78)
keyword: IOP(6/7=3)
keyword: IOP(3/5=10)
keyword: IOP(3/175=01217700)
keyword: IOP(3/177=414500)
keyword: IOP(3/178=4859300)
keyword: SCF=YQC
title: #P opt EmpiricalDispersion=GD3BJ integral(grid=ultrafinegrid) GFInput
nucrepener: 741.4667216491
basis: NPDir=0 NMtPBC= 1 NCelOv= 1 NCel= 1 NClECP= 1 NCelD= 1
basis: NCelK= 1 NCelE2= 1 NClLst= 1 CellRange= 0.0.
basis: One-electron integrals computed using PRISM.
basis: One-electron integral symmetry used in STVInt
basis: NBasis= 472 RedAO= T EigKep= 1.50D-06 NBF= 472
basis: NBsUse= 470 1.00D-06 EigRej= 5.94D-07 NBFU= 470
converged: YES YES YES YES
title: Mulliken charges:
elementType: C C C C C C C C C C F F F H H H H H
charge: 0.452727 -0.169203 -0.061767 -0.216287 0.079500 -0.461061 0.149625 0.182957 0.157029 -0.064323 -0.239966 -0.226871 -0.229970 0.135062 0.143547 0.090997 0.146282 0.131722
chargesum: 0.00000
charge: 0.413440 -0.117720 -0.077160 -0.180960 0.034796 -0.497571 0.162553 0.140314 0.207482 -0.031956 -0.228882 -0.224697 -0.227893 0.128441 0.140271 0.086738 0.144676 0.128128
chargesum: -0.00000
dipole: 2.1591 -1.7292 -0.0000
dipole: 2.7662
quadrupole: -73.1293 -67.4077 -74.0614
quadrupole: -2.3904 0.0000 -0.0000
quadrupole: -1.5965 4.1251 -2.5286 -2.3904 0.0000 -0.0000
hfenergy: -682.7536865 hartree
pointgroup: C01 [X(C10H5F3)]
dipole: -0.9715089 0.486534 0.0620381 debye
InChI: InChI=1/10C.3F.5H
charge 0 multiplicity 1
18 atoms
C  0.02518404 -0.68451964 -0.06129749
C  -0.07039823 0.71723859 0.0650799
C  1.11778923 1.47132343 0.10905583
C  -1.17160386 -1.41652758 -0.10314586
C  1.28446056 -1.30588495 -0.14088715
C  -1.33975017 1.32052787 0.14325904
C  2.31519205 0.85044791 0.03070788
C  -2.38983739 -0.83298646 -0.02771115
C  2.39956696 -0.54516145 -0.09490566
C  -2.46655555 0.56232836 0.09772862
F  -1.07935506 -2.73332842 -0.22191111
F  3.44032321 1.53407837 0.0696472
F  3.59848572 -1.08568227 -0.16614437
H  1.08481664 2.54510992 0.20508501
H  1.36803433 -2.37549342 -0.23752511
H  -1.40371514 2.39327487 0.23979603
H  -3.27622957 -1.4450286 -0.0649141
H  -3.43640676 1.03028545 0.15808449
