program: Gaussian 16
title: 3F_isomer_18 opt
version: ES64L-G16RevC.02
basis: CBSB1
frameworkgroup: C1[X(C10H5F3)]
method: RHF
basis: STO-3G
operation: FOpt
keyword: #P
keyword: opt
keyword: EmpiricalDispersion=GD3BJ
keyword: integral(grid=ultrafinegrid)
keyword: GFInput
keyword: pop=full
keyword: IOP(3/74=-78)
keyword: IOP(6/7=3)
keyword: IOP(3/5=10)
keyword: IOP(3/175=01217700)
keyword: IOP(3/177=414500)
keyword: IOP(3/178=4859300)
keyword: SCF=YQC
title: #P opt EmpiricalDispersion=GD3BJ integral(grid=ultrafinegrid) GFInput
nucrepener: 735.4676047728
basis: NPDir=0 NMtPBC= 1 NCelOv= 1 NCel= 1 NClECP= 1 NCelD= 1
basis: NCelK= 1 NCelE2= 1 NClLst= 1 CellRange= 0.0.
basis: One-electron integrals computed using PRISM.
basis: One-electron integral symmetry used in STVInt
basis: NBasis= 472 RedAO= T EigKep= 1.53D-06 NBF= 472
basis: NBsUse= 470 1.00D-06 EigRej= 6.85D-07 NBFU= 470
converged: YES YES YES YES
title: Mulliken charges:
elementType: C C C C C C C C C C F F F H H H H H
charge: 0.475477 -0.100229 -0.395964 0.021275 -0.210647 -0.215100 -0.254794 -0.207338 0.568764 0.301059 -0.234989 -0.219164 -0.224541 0.121504 0.138831 0.106436 0.178416 0.151004
chargesum: 0.00000
charge: 0.418307 -0.027431 -0.477670 -0.064740 -0.171931 -0.135511 -0.238237 -0.158032 0.520555 0.290192 -0.220561 -0.204833 -0.213658 0.120423 0.138489 0.098641 0.176299 0.149696
chargesum: -0.00000
dipole: -0.0083 -1.4018 0.0000
dipole: 1.4019
quadrupole: -77.4383 -65.9714 -74.0433
quadrupole: 4.9232 -0.0000 -0.0000
quadrupole: -4.9540 6.5129 -1.5590 4.9232 -0.0000 -0.0000
hfenergy: -682.7589725 hartree
pointgroup: C01 [X(C10H5F3)]
dipole: 0.2021965 0.5078356 0.0735284 debye
InChI: InChI=1/10C.3F.5H
charge 0 multiplicity 1
18 atoms
C  -0.11286517 -0.67303137 -0.09556283
C  0.12466326 0.70370989 0.09999957
C  -0.95745791 1.59750454 0.21194468
C  0.9601364 -1.57433402 -0.20866951
C  1.46105519 1.1416086 0.17751561
C  -1.45129912 -1.09312079 -0.17061128
C  -2.21710642 1.11440565 0.12903494
C  2.22034813 -1.09151238 -0.12579166
C  -2.4969226 -0.2414327 -0.0641156
C  2.49314628 0.26577073 0.06747596
F  -1.68354435 -2.38189753 -0.35379851
F  -3.24979307 1.93588779 0.23146038
F  3.25057788 -1.91760424 -0.22889193
H  -0.78969276 2.651748 0.36152555
H  0.78422473 -2.62632042 -0.35803349
H  1.65767684 2.19214804 0.32692857
H  -3.51316305 -0.59289219 -0.12564574
H  3.52001772 0.58936239 0.12523527
