program: Gaussian 16
title: 3F_isomer_26 opt
version: ES64L-G16RevC.02
basis: CBSB1
frameworkgroup: C1[X(C10H5F3)]
method: RHF
basis: STO-3G
operation: FOpt
keyword: #P
keyword: opt
keyword: EmpiricalDispersion=GD3BJ
keyword: integral(grid=ultrafinegrid)
keyword: GFInput
keyword: pop=full
keyword: IOP(3/74=-78)
keyword: IOP(6/7=3)
keyword: IOP(3/5=10)
keyword: IOP(3/175=01217700)
keyword: IOP(3/177=414500)
keyword: IOP(3/178=4859300)
keyword: SCF=YQC
title: #P opt EmpiricalDispersion=GD3BJ integral(grid=ultrafinegrid) GFInput
nucrepener: 756.4744105347
basis: NPDir=0 NMtPBC= 1 NCelOv= 1 NCel= 1 NClECP= 1 NCelD= 1
basis: NCelK= 1 NCelE2= 1 NClLst= 1 CellRange= 0.0.
basis: One-electron integrals computed using PRISM.
basis: One-electron integral symmetry used in STVInt
basis: NBasis= 472 RedAO= T EigKep= 1.75D-06 NBF= 472
basis: NBsUse= 470 1.00D-06 EigRej= 6.35D-07 NBFU= 470
converged: YES YES YES YES
title: Mulliken charges:
elementType: C C C C C C C C C C F F F H H H H H
charge: 0.282892 -0.092316 -0.330230 0.164140 0.211025 -0.404902 0.278738 0.061425 -0.010934 -0.070486 -0.242044 -0.252390 -0.227878 0.105573 0.097438 0.154442 0.147062 0.128443
chargesum: 0.00000
charge: 0.182721 0.014866 -0.310196 0.159037 0.175231 -0.433693 0.298605 0.030733 0.021260 -0.029781 -0.237462 -0.262162 -0.222107 0.099231 0.091647 0.150883 0.146160 0.125026
chargesum: -0.00000
dipole: 1.8270 -3.3091 -0.0000
dipole: 3.7800
quadrupole: -66.5209 -69.0459 -74.0888
quadrupole: 2.6453 -0.0000 0.0000
quadrupole: 3.3643 0.8393 -4.2036 2.6453 -0.0000 0.0000
hfenergy: -682.7472237 hartree
pointgroup: C01 [X(C10H5F3)]
dipole: 0.77213 -1.2701701 0.0458952 debye
InChI: InChI=1/10C.3F.5H
charge 0 multiplicity 1
18 atoms
C  -0.11410288 0.68127576 -0.01833493
C  0.1440622 -0.70995445 0.01963451
C  -0.93749424 -1.61007559 0.01806235
C  0.99576381 1.54829905 -0.01539528
C  -1.45301494 1.11056315 -0.05641277
C  1.47506109 -1.16668803 0.0581888
C  -2.21831236 -1.16376858 -0.01919775
C  2.26938302 1.0912766 0.02196381
C  -2.46671982 0.20760459 -0.0564986
C  2.51013653 -0.28897466 0.05931184
F  0.78887946 2.8522884 -0.05025089
F  -1.74799744 2.39136783 -0.09256958
F  -3.71401774 0.63466856 -0.09260606
H  -0.73203531 -2.66857739 0.04714
H  1.65490048 -2.23018262 0.08684703
H  -3.0597906 -1.83791852 -0.02103375
H  3.07782314 1.80431974 0.02219675
H  3.5274766 -0.64552283 0.08895454
