program: Gaussian 16
title: 4F_isomer_29 opt
version: ES64L-G16RevC.02
basis: CBSB1
frameworkgroup: C1[X(C10H4F4)]
method: RHF
basis: STO-3G
operation: FOpt
keyword: #P
keyword: opt
keyword: EmpiricalDispersion=GD3BJ
keyword: integral(grid=ultrafinegrid)
keyword: GFInput
keyword: pop=full
keyword: IOP(3/74=-78)
keyword: IOP(6/7=3)
keyword: IOP(3/5=10)
keyword: IOP(3/175=01217700)
keyword: IOP(3/177=414500)
keyword: IOP(3/178=4859300)
keyword: SCF=YQC
title: #P opt EmpiricalDispersion=GD3BJ integral(grid=ultrafinegrid) GFInput
nucrepener: 848.1106461599
basis: NPDir=0 NMtPBC= 1 NCelOv= 1 NCel= 1 NClECP= 1 NCelD= 1
basis: NCelK= 1 NCelE2= 1 NClLst= 1 CellRange= 0.0.
basis: One-electron integrals computed using PRISM.
basis: One-electron integral symmetry used in STVInt
basis: NBasis= 500 RedAO= T EigKep= 1.49D-06 NBF= 500
basis: NBsUse= 498 1.00D-06 EigRej= 6.32D-07 NBFU= 498
converged: YES YES YES YES
title: Mulliken charges:
elementType: C C C C C C C C C C F F F F H H H H
charge: -0.242459 0.493082 -0.149704 -0.156626 -0.295746 0.033436 0.482596 0.297887 0.118368 -0.187403 -0.244575 -0.234117 -0.225480 -0.220092 0.107000 0.129948 0.141607 0.152279
chargesum: 0.00000
charge: -0.173767 0.485549 -0.117676 -0.121535 -0.347217 -0.096149 0.514767 0.293523 0.112439 -0.147697 -0.242020 -0.246205 -0.219857 -0.208659 0.098901 0.125970 0.139322 0.150314
chargesum: -0.00000
dipole: -1.3660 -2.2899 0.0000
dipole: 2.6663
quadrupole: -85.0050 -71.1543 -77.3491
quadrupole: 2.7405 -0.0000 0.0000
quadrupole: -7.1689 6.6819 0.4870 2.7405 -0.0000 0.0000
hfenergy: -781.8913392 hartree
pointgroup: C01 [X(C10H4F4)]
dipole: 0.5613668 -0.8750383 -0.1400647 debye
InChI: InChI=1/10C.4F.4H
charge 0 multiplicity 1
18 atoms
C  -0.02060078 -0.72286673 -0.06894322
C  0.04790029 0.68002332 0.06210324
C  -1.15179548 1.38390175 0.24700357
C  1.1801997 -1.43365288 -0.25462796
C  -1.26674356 -1.37426437 -0.01254652
C  1.28739226 1.34072396 0.00726142
C  -2.34707678 0.74610744 0.29982439
C  2.37499359 -0.79032949 -0.30685923
C  -2.39196939 -0.64927579 0.16723516
C  2.40515001 0.60062321 -0.17328228
F  -1.11681277 2.69441263 0.37222145
F  -3.46326005 1.4127068 0.47300383
F  -3.57639994 -1.22140918 0.22545173
F  3.58477003 1.19780975 -0.22857504
H  1.13953007 -2.50728936 -0.35605312
H  -1.33534905 -2.44568389 -0.11105684
H  1.34860606 2.4113817 0.10641086
H  3.30146579 -1.32291785 -0.44857144
