program: Gaussian 16
title: 4F_isomer_34 opt
version: ES64L-G16RevC.02
basis: CBSB1
frameworkgroup: C1[X(C10H4F4)]
method: RHF
basis: STO-3G
operation: FOpt
keyword: #P
keyword: opt
keyword: EmpiricalDispersion=GD3BJ
keyword: integral(grid=ultrafinegrid)
keyword: GFInput
keyword: pop=full
keyword: IOP(3/74=-78)
keyword: IOP(6/7=3)
keyword: IOP(3/5=10)
keyword: IOP(3/175=01217700)
keyword: IOP(3/177=414500)
keyword: IOP(3/178=4859300)
keyword: SCF=YQC
title: #P opt EmpiricalDispersion=GD3BJ integral(grid=ultrafinegrid) GFInput
nucrepener: 841.1786837997
basis: NPDir=0 NMtPBC= 1 NCelOv= 1 NCel= 1 NClECP= 1 NCelD= 1
basis: NCelK= 1 NCelE2= 1 NClLst= 1 CellRange= 0.0.
basis: One-electron integrals computed using PRISM.
basis: One-electron integral symmetry used in STVInt
basis: NBasis= 500 RedAO= T EigKep= 1.51D-06 NBF= 500
basis: NBsUse= 498 1.00D-06 EigRej= 6.53D-07 NBFU= 498
converged: YES YES YES YES
title: Mulliken charges:
elementType: C C C C C C C C C C F F F F H H H H
charge: 0.438083 -0.080195 -0.087523 -0.251210 0.087378 -0.399990 0.146674 0.593622 0.134493 -0.255060 -0.233963 -0.225081 -0.230258 -0.215967 0.133886 0.145924 0.118620 0.180567
chargesum: 0.00000
charge: 0.359750 -0.008688 -0.078528 -0.174959 0.067896 -0.479418 0.142375 0.556886 0.184169 -0.258732 -0.220698 -0.221936 -0.230432 -0.200660 0.126249 0.142348 0.116614 0.177762
chargesum: -0.00000
dipole: 1.0221 -0.5002 0.0000
dipole: 1.1379
quadrupole: -85.5218 -72.7886 -77.3530
quadrupole: 1.7420 0.0000 -0.0000
quadrupole: -6.9673 5.7659 1.2015 1.7420 0.0000 -0.0000
hfenergy: -781.8983115 hartree
pointgroup: C01 [X(C10H4F4)]
dipole: -0.4024255 -0.1876203 -0.0572115 debye
InChI: InChI=1/10C.4F.4H
charge 0 multiplicity 1
18 atoms
C  0.02499613 0.68780637 0.07826389
C  -0.04455949 -0.71205856 -0.0827172
C  1.15406644 -1.44939013 -0.05552986
C  -1.18128528 1.40535303 0.04819673
C  1.26573307 1.32348655 0.26097727
C  -1.2920611 -1.33700891 -0.26485842
C  2.3338887 -0.81386087 0.12164472
C  -2.38545063 0.81360797 -0.12634676
C  2.39238275 0.57931081 0.2808834
C  -2.40930683 -0.57467524 -0.28190615
F  -1.12037064 2.71694251 0.19864097
F  3.46596572 -1.48387536 0.15023727
F  3.57550309 1.13259432 0.4492696
F  -3.59115797 -1.14279678 -0.45181516
H  1.1451069 -2.52109898 -0.17475878
H  1.32562369 2.39196996 0.38446686
H  -1.36341402 -2.405113 -0.38934491
H  -3.29565952 1.3888083 -0.14530245
