program: Gaussian 16
title: 4F_isomer_40 opt
version: ES64L-G16RevC.02
basis: CBSB1
frameworkgroup: C1[X(C10H4F4)]
method: RHF
basis: STO-3G
operation: FOpt
keyword: #P
keyword: opt
keyword: EmpiricalDispersion=GD3BJ
keyword: integral(grid=ultrafinegrid)
keyword: GFInput
keyword: pop=full
keyword: IOP(3/74=-78)
keyword: IOP(6/7=3)
keyword: IOP(3/5=10)
keyword: IOP(3/175=01217700)
keyword: IOP(3/177=414500)
keyword: IOP(3/178=4859300)
keyword: SCF=YQC
title: #P opt EmpiricalDispersion=GD3BJ integral(grid=ultrafinegrid) GFInput
nucrepener: 864.9344837708
basis: NPDir=0 NMtPBC= 1 NCelOv= 1 NCel= 1 NClECP= 1 NCelD= 1
basis: NCelK= 1 NCelE2= 1 NClLst= 1 CellRange= 0.0.
basis: One-electron integrals computed using PRISM.
basis: One-electron integral symmetry used in STVInt
basis: NBasis= 500 RedAO= T EigKep= 1.63D-06 NBF= 500
basis: NBsUse= 498 1.00D-06 EigRej= 6.38D-07 NBFU= 498
converged: YES YES YES YES
title: Mulliken charges:
elementType: C C C C C C C C C C F F F F H H H H
charge: -0.278227 0.148676 -0.249132 0.370812 0.140488 -0.194032 0.093643 -0.005718 0.330233 0.010891 -0.250261 -0.242782 -0.240632 -0.223287 0.126613 0.148991 0.181029 0.132696
chargesum: 0.00000
charge: -0.409623 0.220910 -0.289802 0.394043 0.176670 -0.255197 0.147095 -0.005989 0.339934 0.052079 -0.254768 -0.234962 -0.236177 -0.219589 0.122280 0.148203 0.177183 0.127709
chargesum: -0.00000
dipole: -1.0843 1.2664 0.0000
dipole: 1.6672
quadrupole: -77.6703 -73.1611 -77.3833
quadrupole: -9.7529 0.0000 0.0000
quadrupole: -1.5987 2.9104 -1.3117 -9.7529 0.0000 0.0000
hfenergy: -781.8904524 hartree
pointgroup: C01 [X(C10H4F4)]
dipole: -0.6427967 -0.1302555 0.008872 debye
InChI: InChI=1/10C.4F.4H
charge 0 multiplicity 1
18 atoms
C  0.06291569 0.71343815 -0.05553994
C  -0.08955728 -0.6891494 0.05359142
C  1.06074295 -1.49002114 0.11839026
C  -1.11362947 1.4843636 -0.11805477
C  1.36980962 1.23547909 -0.09364768
C  -1.37435926 -1.25928158 0.09549576
C  2.29646515 -0.93802848 0.07780274
C  -2.34731782 0.92763701 -0.07709397
C  2.46473817 0.44257421 -0.02958155
C  -2.4727234 -0.46311503 0.03116825
F  0.92650846 -2.79890256 0.22024688
F  -1.01179427 2.7951598 -0.22012604
F  1.5451743 2.53760406 -0.19489426
F  3.36478995 -1.70372712 0.13969273
H  -1.46702846 -2.32887074 0.17876489
H  -3.21143793 1.56959195 -0.12891857
H  3.45482432 0.86563634 -0.0606025
H  -3.45811973 -0.90038715 0.06330736
