program: Gaussian 16
title: 4F_isomer_49 opt
version: ES64L-G16RevC.02
basis: CBSB1
frameworkgroup: C1[X(C10H4F4)]
method: RHF
basis: STO-3G
operation: FOpt
keyword: #P
keyword: opt
keyword: EmpiricalDispersion=GD3BJ
keyword: integral(grid=ultrafinegrid)
keyword: GFInput
keyword: pop=full
keyword: IOP(3/74=-78)
keyword: IOP(6/7=3)
keyword: IOP(3/5=10)
keyword: IOP(3/175=01217700)
keyword: IOP(3/177=414500)
keyword: IOP(3/178=4859300)
keyword: SCF=YQC
title: #P opt EmpiricalDispersion=GD3BJ integral(grid=ultrafinegrid) GFInput
nucrepener: 872.4317930974
basis: NPDir=0 NMtPBC= 1 NCelOv= 1 NCel= 1 NClECP= 1 NCelD= 1
basis: NCelK= 1 NCelE2= 1 NClLst= 1 CellRange= 0.0.
basis: One-electron integrals computed using PRISM.
basis: One-electron integral symmetry used in STVInt
basis: NBasis= 500 RedAO= T EigKep= 1.42D-06 NBF= 500
basis: NBsUse= 498 1.00D-06 EigRej= 6.16D-07 NBFU= 498
converged: YES YES YES YES
title: Mulliken charges:
elementType: C C C C C C C C C C F F F F H H H H
charge: -0.095039 -0.095041 0.099026 0.099026 0.099026 0.099027 0.038582 0.038578 0.038581 0.038582 -0.244492 -0.244492 -0.244492 -0.244492 0.154405 0.154405 0.154405 0.154405
chargesum: 0.00000
charge: -0.164978 -0.164978 0.121158 0.121158 0.121158 0.121158 0.050795 0.050795 0.050795 0.050795 -0.241228 -0.241228 -0.241228 -0.241228 0.151764 0.151764 0.151764 0.151764
chargesum: -0.00000
dipole: -0.0000 0.0000 0.0000
dipole: 0.0000
quadrupole: -88.4456 -60.5751 -77.3589
quadrupole: 0.0000 -0.0000 -0.0000
quadrupole: -12.9857 14.8848 -1.8990 0.0000 -0.0000 -0.0000
hfenergy: -781.8895202 hartree
pointgroup: C01 [X(C10H4F4)]
dipole: 0. 0. 0. debye
InChI: InChI=1/10C.4F.4H
charge 0 multiplicity 1
18 atoms
C  -0.12348119 0.69886903 0.01457762
C  0.12348119 -0.69886857 -0.01457798
C  -0.98580988 -1.56695375 -0.00270698
C  0.98580987 1.56695418 0.00270623
C  1.46289902 -1.13323619 -0.05361705
C  -1.46289905 1.13323666 0.05361706
C  -2.25790497 -1.1096922 0.03511547
C  2.25790499 1.10969263 -0.03511589
C  -2.50110859 0.26677185 0.06382755
C  2.5011086 -0.2667714 -0.06382752
F  -0.78289643 -2.87117689 -0.02925819
F  0.78289649 2.87117734 0.02925791
F  1.71919418 -2.42800432 -0.08127838
F  -1.71919419 2.42800478 0.08127831
H  3.06999007 1.81799666 -0.04259327
H  -3.0699901 -1.81799617 0.04259298
H  -3.50660891 0.65314343 0.09413901
H  3.50660889 -0.65314308 -0.09413887
