program: Gaussian 16
title: 5F_isomer_53 opt
version: ES64L-G16RevC.02
basis: CBSB1
frameworkgroup: C1[X(C10H3F5)]
method: RHF
basis: STO-3G
operation: FOpt
keyword: #P
keyword: opt
keyword: EmpiricalDispersion=GD3BJ
keyword: integral(grid=ultrafinegrid)
keyword: GFInput
keyword: pop=full
keyword: IOP(3/74=-78)
keyword: IOP(6/7=3)
keyword: IOP(3/5=10)
keyword: IOP(3/175=01217700)
keyword: IOP(3/177=414500)
keyword: IOP(3/178=4859300)
keyword: SCF=YQC
title: #P opt EmpiricalDispersion=GD3BJ integral(grid=ultrafinegrid) GFInput
nucrepener: 986.6617036044
basis: NPDir=0 NMtPBC= 1 NCelOv= 1 NCel= 1 NClECP= 1 NCelD= 1
basis: NCelK= 1 NCelE2= 1 NClLst= 1 CellRange= 0.0.
basis: One-electron integrals computed using PRISM.
basis: One-electron integral symmetry used in STVInt
basis: NBasis= 528 RedAO= T EigKep= 1.53D-06 NBF= 528
basis: NBsUse= 526 1.00D-06 EigRej= 5.76D-07 NBFU= 526
converged: YES YES YES YES
title: Mulliken charges:
elementType: C C C C C C C C C C F F F F F H H H
charge: -0.276698 0.105060 -0.130914 0.384038 0.209070 -0.143177 0.410352 -0.001026 0.255123 -0.026070 -0.246092 -0.241888 -0.251229 -0.230366 -0.230015 0.128376 0.152662 0.132793
chargesum: 0.00000
charge: -0.354515 0.192445 -0.114215 0.387882 0.187218 -0.200798 0.464918 -0.019042 0.260713 0.013484 -0.245717 -0.236981 -0.263070 -0.241179 -0.233202 0.123936 0.151198 0.126926
chargesum: -0.00000
dipole: 2.3825 2.0294 0.0000
dipole: 3.1296
quadrupole: -78.3539 -84.3859 -80.6962
quadrupole: 5.5975 0.0000 0.0000
quadrupole: 2.7914 -3.2406 0.4492 5.5975 0.0000 0.0000
hfenergy: -881.0216179 hartree
pointgroup: C01 [X(C10H3F5)]
dipole: 1.1591796 -0.4151633 0.0003462 debye
InChI: InChI=1/10C.5F.3H
charge 0 multiplicity 1
18 atoms
C  -0.04554332 0.70711897 0.06675856
C  0.09656563 -0.69405147 -0.06371263
C  -1.06037328 -1.47869108 -0.17995038
C  1.13767991 1.46167976 0.181007
C  -1.33854081 1.25981062 0.07503268
C  1.37477204 -1.27966223 -0.0756857
C  -2.29452829 -0.9220453 -0.16923926
C  2.36482673 0.89002676 0.16859909
C  -2.43226073 0.46582088 -0.03990155
C  2.4803136 -0.49965784 0.03830809
F  -0.94352574 -2.78497441 -0.30213179
F  1.04529443 2.77153595 0.30438581
F  -1.52118196 2.55478047 0.19382257
F  -3.37528617 -1.6537023 -0.27769652
F  -3.63888201 0.97675359 -0.03264683
H  1.45611434 -2.3487131 -0.17617733
H  3.2334349 1.52158699 0.25997237
H  3.4611207 -0.94761626 0.02925484
