program: Gaussian 16
title: 5F_isomer_54 opt
version: ES64L-G16RevC.02
basis: CBSB1
frameworkgroup: C1[X(C10H3F5)]
method: RHF
basis: STO-3G
operation: FOpt
keyword: #P
keyword: opt
keyword: EmpiricalDispersion=GD3BJ
keyword: integral(grid=ultrafinegrid)
keyword: GFInput
keyword: pop=full
keyword: IOP(3/74=-78)
keyword: IOP(6/7=3)
keyword: IOP(3/5=10)
keyword: IOP(3/175=01217700)
keyword: IOP(3/177=414500)
keyword: IOP(3/178=4859300)
keyword: SCF=YQC
title: #P opt EmpiricalDispersion=GD3BJ integral(grid=ultrafinegrid) GFInput
nucrepener: 958.1733471656
basis: NPDir=0 NMtPBC= 1 NCelOv= 1 NCel= 1 NClECP= 1 NCelD= 1
basis: NCelK= 1 NCelE2= 1 NClLst= 1 CellRange= 0.0.
basis: One-electron integrals computed using PRISM.
basis: One-electron integral symmetry used in STVInt
basis: NBasis= 528 RedAO= T EigKep= 1.47D-06 NBF= 528
basis: NBsUse= 526 1.00D-06 EigRej= 6.10D-07 NBFU= 526
converged: YES YES YES YES
title: Mulliken charges:
elementType: C C C C C C C C C C F F F F F H H H
charge: 0.443187 -0.204601 -0.055253 -0.173838 -0.307525 0.097844 0.158067 0.502542 0.119036 0.161328 -0.243375 -0.223683 -0.234286 -0.222088 -0.226107 0.133354 0.127106 0.148290
chargesum: 0.00000
charge: 0.423366 -0.147267 -0.053037 -0.147678 -0.360734 0.038124 0.163544 0.552858 0.095575 0.199367 -0.241544 -0.222732 -0.249397 -0.215152 -0.225780 0.125760 0.122060 0.142666
chargesum: -0.00000
dipole: 0.3186 -1.3277 0.0000
dipole: 1.3654
quadrupole: -96.3488 -76.5392 -80.6521
quadrupole: 0.5530 0.0000 0.0000
quadrupole: -11.8355 7.9742 3.8613 0.5530 0.0000 0.0000
hfenergy: -881.0300444 hartree
pointgroup: C01 [X(C10H3F5)]
dipole: 0.0498017 -0.5254064 -0.1001734 debye
InChI: InChI=1/10C.5F.3H
charge 0 multiplicity 1
18 atoms
C  0.06729543 0.67025615 0.13810965
C  -0.06594099 -0.705021 -0.14489028
C  1.0975451 -1.49383397 -0.20941558
C  -1.09729811 1.44950813 0.20065405
C  -1.34292481 -1.25596024 -0.35476917
C  1.33846291 1.23230256 0.34972994
C  2.30819471 -0.92994867 -0.00220348
C  -2.32394061 0.90897082 -0.00319451
C  -2.43300417 -0.460138 -0.28306614
C  2.43001389 0.43949113 0.27873838
F  -0.99604486 2.73530557 0.46339979
F  3.40946314 -1.64793353 -0.05760298
F  -3.40829417 1.64439389 0.05699392
F  -3.64290895 -0.94008215 -0.47358744
F  3.637985 0.9246974 0.47015058
H  1.03640268 -2.54901347 -0.42330661
H  -1.46542025 -2.30456141 -0.57219583
H  1.45041505 2.28156779 0.56645672
