program: Gaussian 16
title: 5F_isomer_55 opt
version: ES64L-G16RevC.02
basis: CBSB1
frameworkgroup: C1[X(C10H3F5)]
method: RHF
basis: STO-3G
operation: FOpt
keyword: #P
keyword: opt
keyword: EmpiricalDispersion=GD3BJ
keyword: integral(grid=ultrafinegrid)
keyword: GFInput
keyword: pop=full
keyword: IOP(3/74=-78)
keyword: IOP(6/7=3)
keyword: IOP(3/5=10)
keyword: IOP(3/175=01217700)
keyword: IOP(3/177=414500)
keyword: IOP(3/178=4859300)
keyword: SCF=YQC
title: #P opt EmpiricalDispersion=GD3BJ integral(grid=ultrafinegrid) GFInput
nucrepener: 963.7382875382
basis: NPDir=0 NMtPBC= 1 NCelOv= 1 NCel= 1 NClECP= 1 NCelD= 1
basis: NCelK= 1 NCelE2= 1 NClLst= 1 CellRange= 0.0.
basis: One-electron integrals computed using PRISM.
basis: One-electron integral symmetry used in STVInt
basis: NBasis= 528 RedAO= T EigKep= 1.44D-06 NBF= 528
basis: NBsUse= 526 1.00D-06 EigRej= 6.44D-07 NBFU= 526
converged: YES YES YES YES
title: Mulliken charges:
elementType: C C C C C C C C C C F F F F F H H H
charge: 0.093556 -0.043521 -0.090220 -0.172974 0.004603 0.007890 0.106997 -0.216312 0.462483 0.526895 -0.243641 -0.233572 -0.225887 -0.215309 -0.232210 0.145979 0.142592 0.182650
chargesum: 0.00000
charge: 0.162700 -0.005950 -0.175028 -0.327194 0.021872 0.060726 0.121511 -0.198809 0.503227 0.498116 -0.238961 -0.218385 -0.220583 -0.201436 -0.245055 0.142777 0.140744 0.179728
chargesum: -0.00000
dipole: 1.2807 0.7641 -0.0000
dipole: 1.4913
quadrupole: -87.1893 -82.2087 -80.6816
quadrupole: 0.9743 -0.0000 -0.0000
quadrupole: -3.8294 1.1512 2.6783 0.9743 -0.0000 -0.0000
hfenergy: -881.0353687 hartree
pointgroup: C01 [X(C10H3F5)]
dipole: -0.5249195 0.2621057 0.00001 debye
InChI: InChI=1/10C.5F.3H
charge 0 multiplicity 1
18 atoms
C  0.05597109 -0.69817767 -0.01063647
C  -0.07986245 0.70445615 0.01054752
C  1.04837674 1.54189711 0.03275378
C  -1.07302704 -1.53541149 -0.03284597
C  1.3590444 -1.21857775 -0.00859455
C  -1.38855132 1.21456044 0.00829843
C  2.27790299 0.98290269 0.0336021
C  -2.29688214 -0.95938519 -0.03337977
C  2.44722398 -0.4093297 0.01284876
C  -2.48687703 0.42507206 -0.01291198
F  1.52909901 -2.52325818 -0.02795253
F  -1.53395262 2.52678821 0.02796998
F  3.36708231 1.71995581 0.05390925
F  -3.37955174 -1.71573554 -0.0539405
F  3.6585865 -0.9088919 0.01449695
H  0.94263066 2.61324905 0.04891883
H  -0.96922808 -2.60663096 -0.0490242
H  -3.47798526 0.84651587 -0.01405862
