program: Gaussian 16
title: 5F_isomer_62 opt
version: ES64L-G16RevC.02
basis: CBSB1
frameworkgroup: C1[X(C10H3F5)]
method: RHF
basis: STO-3G
operation: FOpt
keyword: #P
keyword: opt
keyword: EmpiricalDispersion=GD3BJ
keyword: integral(grid=ultrafinegrid)
keyword: GFInput
keyword: pop=full
keyword: IOP(3/74=-78)
keyword: IOP(6/7=3)
keyword: IOP(3/5=10)
keyword: IOP(3/175=01217700)
keyword: IOP(3/177=414500)
keyword: IOP(3/178=4859300)
keyword: SCF=YQC
title: #P opt EmpiricalDispersion=GD3BJ integral(grid=ultrafinegrid) GFInput
nucrepener: 987.2608855151
basis: NPDir=0 NMtPBC= 1 NCelOv= 1 NCel= 1 NClECP= 1 NCelD= 1
basis: NCelK= 1 NCelE2= 1 NClLst= 1 CellRange= 0.0.
basis: One-electron integrals computed using PRISM.
basis: One-electron integral symmetry used in STVInt
basis: NBasis= 528 RedAO= T EigKep= 1.50D-06 NBF= 528
basis: NBsUse= 526 1.00D-06 EigRej= 6.43D-07 NBFU= 526
converged: YES YES YES YES
title: Mulliken charges:
elementType: C C C C C C C C C C F F F F F H H H
charge: -0.135715 -0.112693 0.150641 0.157723 0.206618 0.121982 -0.061945 0.006168 0.343514 0.028339 -0.252803 -0.245434 -0.238683 -0.244107 -0.220392 0.155415 0.183388 0.157984
chargesum: 0.00000
charge: -0.196541 -0.141425 0.103521 0.190990 0.265393 0.115183 -0.019669 0.010299 0.374268 0.010534 -0.265558 -0.243555 -0.231934 -0.243296 -0.213668 0.152073 0.178848 0.154538
chargesum: -0.00000
dipole: 1.5548 0.0349 -0.0000
dipole: 1.5552
quadrupole: -80.7508 -82.3356 -80.6764
quadrupole: 11.3944 -0.0000 0.0000
quadrupole: 0.5035 -1.0813 0.5778 11.3944 -0.0000 0.0000
hfenergy: -881.027184 hartree
pointgroup: C01 [X(C10H3F5)]
dipole: 0.4983587 -0.3486967 -0.0665061 debye
InChI: InChI=1/10C.5F.3H
charge 0 multiplicity 1
18 atoms
C  -0.0262586 -0.70475097 -0.12427891
C  0.04904299 0.69137853 0.12169342
C  -1.14518441 1.4210574 0.26234767
C  1.17853586 -1.42169379 -0.26278639
C  -1.30386992 -1.28945047 -0.21507146
C  1.32804043 1.27534127 0.2123423
C  -2.34592558 0.79820707 0.16405902
C  2.38740975 -0.8237178 -0.16897421
C  -2.44057826 -0.56956761 -0.07671285
C  2.46135205 0.5514248 0.07330306
F  -1.12142501 2.71541582 0.49084129
F  1.12845244 -2.7200834 -0.49173576
F  -1.40865544 -2.58220653 -0.4424882
F  1.4255672 2.57211956 0.44053948
F  -3.45257281 1.49548523 0.29812868
H  3.2788357 -1.41805014 -0.28274239
H  -3.40586933 -1.04176783 -0.15068963
H  3.41310292 1.05085886 0.15222388
