program: Gaussian 16
title: 5F_isomer_63 opt
version: ES64L-G16RevC.02
basis: CBSB1
frameworkgroup: C1[X(C10H3F5)]
method: RHF
basis: STO-3G
operation: FOpt
keyword: #P
keyword: opt
keyword: EmpiricalDispersion=GD3BJ
keyword: integral(grid=ultrafinegrid)
keyword: GFInput
keyword: pop=full
keyword: IOP(3/74=-78)
keyword: IOP(6/7=3)
keyword: IOP(3/5=10)
keyword: IOP(3/175=01217700)
keyword: IOP(3/177=414500)
keyword: IOP(3/178=4859300)
keyword: SCF=YQC
title: #P opt EmpiricalDispersion=GD3BJ integral(grid=ultrafinegrid) GFInput
nucrepener: 978.7385977356
basis: NPDir=0 NMtPBC= 1 NCelOv= 1 NCel= 1 NClECP= 1 NCelD= 1
basis: NCelK= 1 NCelE2= 1 NClLst= 1 CellRange= 0.0.
basis: One-electron integrals computed using PRISM.
basis: One-electron integral symmetry used in STVInt
basis: NBasis= 528 RedAO= T EigKep= 1.62D-06 NBF= 528
basis: NBsUse= 526 1.00D-06 EigRej= 6.61D-07 NBFU= 526
converged: YES YES YES YES
title: Mulliken charges:
elementType: C C C C C C C C C C F F F F F H H H
charge: -0.225028 -0.017788 -0.102162 0.357892 -0.035712 0.049014 0.446784 -0.002576 0.278863 -0.039964 -0.235591 -0.251287 -0.253741 -0.223067 -0.220629 0.134144 0.182981 0.157866
chargesum: 0.00000
charge: -0.279488 0.039979 -0.034242 0.284118 -0.000544 -0.030653 0.447228 0.026530 0.319400 -0.051525 -0.222776 -0.260689 -0.270993 -0.217520 -0.210341 0.130707 0.178371 0.152437
chargesum: -0.00000
dipole: -0.2017 2.9597 0.0000
dipole: 2.9666
quadrupole: -80.5111 -84.2529 -80.6738
quadrupole: 2.8724 -0.0000 -0.0000
quadrupole: 1.3016 -2.4403 1.1388 2.8724 -0.0000 -0.0000
hfenergy: -881.0283197 hartree
pointgroup: C01 [X(C10H3F5)]
dipole: 0.1222178 1.1302033 0.2644569 debye
InChI: InChI=1/10C.5F.3H
charge 0 multiplicity 1
18 atoms
C  -0.01639815 -0.68219952 -0.15802682
C  0.02262509 0.69562368 0.16130393
C  -1.19909772 1.37716042 0.28465546
C  1.21148688 -1.35598148 -0.27941514
C  1.25318209 1.34740486 0.3461615
C  -1.26637033 -1.30233986 -0.33611815
C  -2.39587318 0.77487127 0.11216966
C  2.38386972 -0.69521257 -0.09410524
C  2.41772202 0.66253089 0.22044315
C  -2.40990603 -0.5846484 -0.20223701
F  -1.15741497 2.66390855 0.58302272
F  1.24412968 -2.63596 -0.57415115
F  -1.34649855 -2.58134023 -0.63377185
F  3.51706164 -1.35399014 -0.21466931
F  -3.57087196 -1.17929225 -0.37195778
H  1.25622635 2.39651063 0.58856312
H  -3.32072676 1.31769677 0.21175888
H  3.37685618 1.13525839 0.35637402
