program: Gaussian 16
title: 6F_isomer_64 opt
version: ES64L-G16RevC.02
basis: CBSB1
frameworkgroup: C1[X(C10H2F6)]
method: RHF
basis: STO-3G
operation: FOpt
keyword: #P
keyword: opt
keyword: EmpiricalDispersion=GD3BJ
keyword: integral(grid=ultrafinegrid)
keyword: GFInput
keyword: pop=full
keyword: IOP(3/74=-78)
keyword: IOP(6/7=3)
keyword: IOP(3/5=10)
keyword: IOP(3/175=01217700)
keyword: IOP(3/177=414500)
keyword: IOP(3/178=4859300)
keyword: SCF=YQC
title: #P opt EmpiricalDispersion=GD3BJ integral(grid=ultrafinegrid) GFInput
nucrepener: 1093.1912615830
basis: NPDir=0 NMtPBC= 1 NCelOv= 1 NCel= 1 NClECP= 1 NCelD= 1
basis: NCelK= 1 NCelE2= 1 NClLst= 1 CellRange= 0.0.
basis: One-electron integrals computed using PRISM.
basis: One-electron integral symmetry used in STVInt
basis: NBasis= 556 RedAO= T EigKep= 1.75D-06 NBF= 556
basis: NBsUse= 554 1.00D-06 EigRej= 6.03D-07 NBFU= 554
converged: YES YES YES YES
title: Mulliken charges:
elementType: C C C C C C C C C C F F F F F F H H
charge: 0.160251 -0.048900 -0.261593 0.279167 -0.261588 0.279161 0.126231 0.366760 0.126227 0.366767 -0.245153 -0.245152 -0.219440 -0.232779 -0.219440 -0.232779 0.131130 0.131130
chargesum: 0.00000
charge: 0.054542 0.070546 -0.304867 0.304441 -0.304867 0.304441 0.126758 0.400435 0.126758 0.400434 -0.253421 -0.253421 -0.215089 -0.244794 -0.215089 -0.244794 0.123994 0.123994
chargesum: -0.00000
dipole: 0.0000 2.5930 -0.0000
dipole: 2.5930
quadrupole: -98.6890 -84.3672 -84.0130
quadrupole: -0.0000 -0.0000 -0.0000
quadrupole: -9.6659 4.6558 5.0101 -0.0000 -0.0000 -0.0000
hfenergy: -980.1616349 hartree
pointgroup: C01 [X(C10H2F6)]
dipole: 0.0384833 0.9903553 0.2417779 debye
InChI: InChI=1/10C.6F.2H
charge 0 multiplicity 1
18 atoms
C  -0.02621562 -0.6746492 -0.16470356
C  0.02713613 0.69834043 0.17048781
C  -1.16674653 1.4091614 0.38641658
C  1.18573837 -1.35732524 -0.37435044
C  1.27354271 1.33920554 0.28454933
C  -1.28846843 -1.28639706 -0.27106744
C  -2.35476657 0.77707446 0.27248312
C  2.37763158 -0.7190317 -0.25902841
C  2.40985018 0.64048702 0.07358935
C  -2.42815867 -0.58126392 -0.05841602
F  1.19041654 -2.6311609 -0.68721586
F  -1.39202369 -2.55712997 -0.57941484
F  -3.48818336 1.41231389 0.46775935
F  3.50304605 -1.36155901 -0.45581592
F  3.59005808 1.20940156 0.17228643
F  -3.60094784 -1.15790839 -0.15926798
H  -1.14404129 2.45571182 0.6425368
H  1.33213136 2.38472726 0.53917172
