program: Gaussian 16
title: 6F_isomer_68 opt
version: ES64L-G16RevC.02
basis: CBSB1
frameworkgroup: C1[X(C10H2F6)]
method: RHF
basis: STO-3G
operation: FOpt
keyword: #P
keyword: opt
keyword: EmpiricalDispersion=GD3BJ
keyword: integral(grid=ultrafinegrid)
keyword: GFInput
keyword: pop=full
keyword: IOP(3/74=-78)
keyword: IOP(6/7=3)
keyword: IOP(3/5=10)
keyword: IOP(3/175=01217700)
keyword: IOP(3/177=414500)
keyword: IOP(3/178=4859300)
keyword: SCF=YQC
title: #P opt EmpiricalDispersion=GD3BJ integral(grid=ultrafinegrid) GFInput
nucrepener: 1098.2914947678
basis: NPDir=0 NMtPBC= 1 NCelOv= 1 NCel= 1 NClECP= 1 NCelD= 1
basis: NCelK= 1 NCelE2= 1 NClLst= 1 CellRange= 0.0.
basis: One-electron integrals computed using PRISM.
basis: One-electron integral symmetry used in STVInt
basis: NBasis= 556 RedAO= T EigKep= 1.50D-06 NBF= 556
basis: NBsUse= 554 1.00D-06 EigRej= 6.41D-07 NBFU= 554
converged: YES YES YES YES
title: Mulliken charges:
elementType: C C C C C C C C C C F F F F F F H H
charge: -0.320237 0.189244 -0.117314 0.408885 0.230950 -0.163171 0.391784 0.379556 0.252539 -0.175729 -0.247190 -0.235706 -0.251349 -0.226680 -0.230910 -0.212862 0.145446 0.182744
chargesum: 0.00000
charge: -0.394742 0.299190 -0.098293 0.448632 0.229476 -0.325965 0.432379 0.378972 0.262468 -0.138747 -0.249122 -0.228394 -0.264231 -0.236127 -0.236501 -0.200560 0.141793 0.179771
chargesum: -0.00000
dipole: -1.4881 -0.3936 -0.0000
dipole: 1.5392
quadrupole: -89.4488 -91.2936 -84.0119
quadrupole: -2.0795 0.0000 -0.0000
quadrupole: -1.1974 -3.0422 4.2395 -2.0795 0.0000 -0.0000
hfenergy: -980.1657859 hartree
pointgroup: C01 [X(C10H2F6)]
dipole: 0.5907555 0.1309435 0.0242243 debye
InChI: InChI=1/10C.6F.2H
charge 0 multiplicity 1
18 atoms
C  -0.04592621 -0.71387003 -0.05109786
C  0.0721675 0.69159894 0.05020755
C  -1.09943819 1.46128807 0.07415408
C  1.15193378 -1.45479778 -0.07236358
C  -1.32812296 -1.28631344 -0.12383546
C  1.33400143 1.30523353 0.12530713
C  -2.32326626 0.88521964 0.00265162
C  2.37028874 -0.8696173 -0.00036157
C  -2.43774645 -0.50696161 -0.09763182
C  2.43468556 0.52090023 0.09852843
F  -1.00610165 2.77150682 0.16816706
F  1.08849646 -2.7652866 -0.16562917
F  -1.48210888 -2.58618748 -0.21867013
F  -3.41573513 1.60491282 0.02512104
F  -3.63510811 -1.03482609 -0.16508788
F  3.63339174 1.06731065 0.16731834
H  1.4211624 2.37504748 0.20234948
H  3.26742422 -1.46515887 -0.01912825
