program: Gaussian 16
title: 7F_isomer_75 opt
version: ES64L-G16RevC.02
basis: CBSB1
frameworkgroup: C1[X(C10HF7)]
method: RHF
basis: STO-3G
operation: FOpt
keyword: #P
keyword: opt
keyword: EmpiricalDispersion=GD3BJ
keyword: integral(grid=ultrafinegrid)
keyword: GFInput
keyword: pop=full
keyword: IOP(3/74=-78)
keyword: IOP(6/7=3)
keyword: IOP(3/5=10)
keyword: IOP(3/175=01217700)
keyword: IOP(3/177=414500)
keyword: IOP(3/178=4859300)
keyword: SCF=YQC
title: #P opt EmpiricalDispersion=GD3BJ integral(grid=ultrafinegrid) GFInput
nucrepener: 1238.1237749491
basis: NPDir=0 NMtPBC= 1 NCelOv= 1 NCel= 1 NClECP= 1 NCelD= 1
basis: NCelK= 1 NCelE2= 1 NClLst= 1 CellRange= 0.0.
basis: One-electron integrals computed using PRISM.
basis: One-electron integral symmetry used in STVInt
basis: NBasis= 584 RedAO= T EigKep= 1.49D-06 NBF= 584
basis: NBsUse= 582 1.00D-06 EigRej= 6.27D-07 NBFU= 582
converged: YES YES YES YES
title: Mulliken charges:
elementType: C C C C C C C C C C F F F F F F F H
charge: -0.172567 -0.162325 0.329299 0.122394 0.221740 0.269596 0.282903 -0.025419 0.280856 0.325492 -0.249459 -0.252841 -0.247993 -0.239100 -0.227827 -0.216516 -0.225290 0.187060
chargesum: 0.00000
charge: -0.181585 -0.167225 0.349840 0.055746 0.202340 0.312054 0.323819 -0.006714 0.304713 0.330843 -0.260057 -0.270178 -0.258689 -0.236946 -0.236863 -0.210983 -0.231312 0.181197
chargesum: -0.00000
dipole: 1.0578 1.0463 -0.0000
dipole: 1.4879
quadrupole: -94.0491 -98.5830 -87.3316
quadrupole: 5.6076 0.0000 -0.0000
quadrupole: -0.7279 -5.2617 5.9896 5.6076 0.0000 -0.0000
hfenergy: -1079.2953997 hartree
pointgroup: C01 [X(C10H1F7)]
dipole: -0.5178627 -0.2717745 -0.0248176 debye
InChI: InChI=1/10C.7F.H
charge 0 multiplicity 1
18 atoms
C  0.05980308 0.70036304 0.02920345
C  -0.08388251 -0.71003405 -0.03024129
C  1.07221488 -1.51091603 -0.03025604
C  -1.09697337 1.50084694 0.02918413
C  1.35630598 1.24165192 0.08585793
C  -1.3881796 -1.23742349 -0.08656103
C  2.3061091 -0.95279154 0.02535475
C  -2.32626815 0.93141811 -0.02674577
C  2.44777748 0.43690299 0.08392944
C  -2.48740564 -0.45025038 -0.08553527
F  0.98464261 -2.81842511 -0.08412
F  -1.00330613 2.81046734 0.08329827
F  1.54231731 2.53960956 0.14203009
F  -1.54964361 -2.54253645 -0.14234463
F  3.38339644 -1.69596969 0.02546364
F  -3.39546014 1.69482042 -0.02583713
F  3.65258253 0.94248375 0.1366786
H  -3.47403026 -0.8802163 -0.12935916
