program: Gaussian 16
title: 8F_isomer_76 opt
version: ES64L-G16RevC.02
basis: CBSB1
frameworkgroup: C1[X(C10F8)]
method: RHF
basis: STO-3G
operation: FOpt
keyword: #P
keyword: optEmpiricalDispersion=GD3BJ
keyword: integral(grid=ultrafinegrid)
keyword: GFInput
keyword: pop=full
keyword: IOP(3/74=-78)
keyword: IOP(6/7=3)
keyword: IOP(3/5=10)
keyword: IOP(3/175=01217700)
keyword: IOP(3/177=414500)
keyword: IOP(3/178=4859300)
keyword: SCF=YQC
title: #P opt EmpiricalDispersion=GD3BJ integral(grid=ultrafinegrid) GFInput
nucrepener: 1374.1608834762
basis: NPDir=0 NMtPBC= 1 NCelOv= 1 NCel= 1 NClECP= 1 NCelD= 1
basis: NCelK= 1 NCelE2= 1 NClLst= 1 CellRange= 0.0.
basis: One-electron integrals computed using PRISM.
basis: One-electron integral symmetry used in STVInt
basis: NBasis= 612 RedAO= T EigKep= 1.44D-06 NBF= 612
basis: NBsUse= 610 1.00D-06 EigRej= 5.77D-07 NBFU= 610
converged: YES YES YES YES
title: Mulliken charges:
elementType: C C C C C C C C C C F F F F F F F F
charge: -0.184752 -0.184752 0.258268 0.258268 0.258270 0.258267 0.307328 0.307326 0.307327 0.307328 -0.248835 -0.248834 -0.248835 -0.248835 -0.224385 -0.224384 -0.224385 -0.224385
chargesum: 0.00000
charge: -0.185665 -0.185665 0.256671 0.256671 0.256671 0.256671 0.331381 0.331381 0.331381 0.331381 -0.262032 -0.262032 -0.262032 -0.262032 -0.233188 -0.233188 -0.233188 -0.233188
chargesum: -0.00000
dipole: -0.0000 -0.0000 -0.0000
dipole: 0.0000
quadrupole: -103.1009 -104.7288 -90.6681
quadrupole: -0.0000 -0.0000 0.0000
quadrupole: -3.6016 -5.2296 8.8312 -0.0000 -0.0000 0.0000
hfenergy: -1178.4259898 hartree
pointgroup: C01 [X(C10F8)]
dipole: 0. 0. -0.0000003 debye
InChI: InChI=1/10C.8F
charge 0 multiplicity 1
18 atoms
C  0.09083961 -0.70327687 -0.00493841
C  -0.09083948 0.7032771 0.00493794
C  1.04427324 1.530361 0.07417029
C  -1.04427311 -1.53036077 -0.07417086
C  -1.39896889 1.21568316 -0.05488901
C  1.39896901 -1.21568294 0.05488877
C  2.29053182 0.99983206 0.13059141
C  -2.29053171 -0.99983184 -0.13059177
C  2.46963069 -0.38674582 0.12085514
C  -2.46963056 0.38674604 -0.12085566
F  -0.9220806 -2.8363514 -0.08571572
F  0.92208067 2.83635161 0.08571631
F  -1.61263408 2.50989254 -0.04817614
F  1.6126342 -2.50989232 0.04817549
F  3.34579599 1.76954535 0.19496374
F  -3.34579587 -1.76954514 -0.19496405
F  -3.68594643 0.86389074 -0.17647437
F  3.68594651 -0.86389052 0.1764749
