program: Gaussian 16
title: Cl3F_isomer_20_0 opt
version: ES64L-G16RevC.02
basis: CBSB1
frameworkgroup: C1[X(C10H5ClF3)]
method: RHF
basis: STO-3G
operation: FOpt
keyword: #P
keyword: opt
keyword: EmpiricalDispersion=GD3BJ
keyword: integral(grid=ultrafinegrid)
keyword: GFInput
keyword: pop=full
keyword: IOP(3/74=-78)
keyword: IOP(6/7=3)
keyword: IOP(3/5=10)
keyword: IOP(3/175=01217700)
keyword: IOP(3/177=414500)
keyword: IOP(3/178=4859300)
keyword: SCF=YQC
title: #P opt EmpiricalDispersion=GD3BJ integral(grid=ultrafinegrid) GFInput
nucrepener: 967.0406602729
basis: NPDir=0 NMtPBC= 1 NCelOv= 1 NCel= 1 NClECP= 1 NCelD= 1
basis: NCelK= 1 NCelE2= 1 NClLst= 1 CellRange= 0.0.
basis: One-electron integrals computed using PRISM.
basis: One-electron integral symmetry used in STVInt
basis: NBasis= 526 RedAO= T EigKep= 1.35D-06 NBF= 526
basis: NBsUse= 524 1.00D-06 EigRej= 5.07D-07 NBFU= 524
converged: YES YES YES YES
title: Mulliken charges:
elementType: C C C C C C C C C C F F F H H H H H Cl
charge: -0.289305 0.171525 -0.403358 -0.342329 0.159065 -0.092909 -0.428999 -0.037793 1.138016 0.091660 -0.249304 -0.248969 -0.221230 0.107851 0.104283 0.093277 0.334694 0.119063 -1.005238
chargesum: -1.00000
charge: -0.051178 0.196448 -0.391153 -0.287170 -0.221244 -0.084948 -0.571486 -0.042693 1.275215 0.170747 -0.214064 -0.239722 -0.196321 0.120430 0.120804 0.104416 0.152779 0.130999 -0.971860
dipole: -18.7707 0.1696 -0.0177
dipole: 18.7715
quadrupole: -185.5397 -92.9514 -91.2033
quadrupole: 9.6538 -0.0938 0.0038
quadrupole: -62.3082 30.2800 32.0282 9.6538 -0.0938 0.0038
hfenergy: -1142.8592489 hartree
pointgroup: C01 [X(C10H5Cl1F3)]
dipole: 7.0734765 -1.8143627 -1.1028133 debye
InChI: InChI=1/10C.Cl.3F.5H
charge -1 multiplicity 1
19 atoms
C  0.32542439 0.77294059 0.29245539
C  0.47200196 -0.54894041 -0.17703861
C  -0.65597982 -1.3568552 -0.38582042
C  1.45738365 1.58161893 0.50125093
C  -0.98643004 1.22494996 0.53395673
C  1.78233801 -0.99205529 -0.41541122
C  -1.88047948 -0.83268199 -0.12473903
C  2.70219348 1.09515557 0.25199683
C  -2.09222878 0.46869726 0.34177207
C  2.8739005 -0.21746318 -0.21590349
F  -1.10932786 2.46589855 0.97374713
F  1.94129284 -2.23735706 -0.85906911
F  -2.94194863 -1.59278189 -0.3212157
H  -0.55765227 -2.36727193 -0.7438101
H  1.31661462 2.58759455 0.8604575
H  3.57032958 1.71545648 0.41216468
H  -3.10470081 0.85136498 0.540421
H  3.8533256 -0.62043401 -0.41905217
Cl -5.15052892 1.62584408 0.95383859
