program: Gaussian 16
title: Cl4F_isomer_37_1 opt
version: ES64L-G16RevC.02
basis: CBSB1
frameworkgroup: C1[X(C10H4ClF4)]
method: RHF
basis: STO-3G
operation: FOpt
keyword: #P
keyword: opt
keyword: EmpiricalDispersion=GD3BJ
keyword: integral(grid=ultrafinegrid)
keyword: GFInput
keyword: pop=full
keyword: IOP(3/74=-78)
keyword: IOP(6/7=3)
keyword: IOP(3/5=10)
keyword: IOP(3/175=01217700)
keyword: IOP(3/177=414500)
keyword: IOP(3/178=4859300)
keyword: SCF=YQC
title: #P opt EmpiricalDispersion=GD3BJ integral(grid=ultrafinegrid) GFInput
nucrepener: 1094.9754099173
basis: NPDir=0 NMtPBC= 1 NCelOv= 1 NCel= 1 NClECP= 1 NCelD= 1
basis: NCelK= 1 NCelE2= 1 NClLst= 1 CellRange= 0.0.
basis: One-electron integrals computed using PRISM.
basis: One-electron integral symmetry used in STVInt
basis: NBasis= 554 RedAO= T EigKep= 1.23D-06 NBF= 554
basis: NBsUse= 552 1.00D-06 EigRej= 5.65D-07 NBFU= 552
converged: YES YES YES YES
title: Mulliken charges:
elementType: C C C C C C C C C C F F F F H H H H Cl
charge: 0.910001 -0.295166 -1.014525 0.553940 0.069701 0.089579 -0.359351 -0.163179 0.404189 0.168917 -0.301595 -0.252484 -0.233502 -0.263637 0.107525 0.236291 0.145765 0.224127 -1.026597
chargesum: -1.00000
charge: 0.330708 0.077307 -0.622169 -0.044801 -0.063861 0.055382 -0.162612 0.291873 0.132445 0.478011 -0.291712 -0.252054 -0.226460 -0.242340 0.156573 0.013468 0.159919 0.166262 -0.955940
dipole: -15.7691 4.0679 0.0102
dipole: 16.2854
quadrupole: -181.0697 -116.7492 -94.4097
quadrupole: 27.1819 0.0430 -0.0125
quadrupole: -50.3268 13.9937 36.3331 27.1819 0.0430 -0.0125
hfenergy: -1242.0007497 hartree
pointgroup: C01 [X(C10H4Cl1F4)]
dipole: -2.7313139 5.6715668 -1.1936642 debye
InChI: InChI=1/10C.Cl.4F.4H
charge -1 multiplicity 1
19 atoms
C  0.0471673 0.39106115 -0.07667979
C  -0.33252044 -0.94992247 0.18614545
C  -1.6993103 -1.2960751 0.22708242
C  1.41791648 0.69553575 -0.10928426
C  0.65958249 -1.92052447 0.40320575
C  -0.98379768 1.32549856 -0.28721102
C  -2.62840307 -0.34207428 0.01470277
C  2.34490832 -0.27353646 0.10598719
C  -2.2944958 0.98890007 -0.24702708
C  1.97667978 -1.5910072 0.36444337
F  1.8271108 1.93181751 -0.35042018
F  -0.67452266 2.58960822 -0.53611739
F  -3.92412924 -0.64381976 0.04814987
F  3.6270902 0.05641702 0.06629399
H  -1.98607459 -2.31561233 0.42684241
H  0.41917231 -2.95642689 0.60689487
H  -3.05789434 1.73027948 -0.41299849
H  2.70950916 -2.36776857 0.53638375
Cl 1.93559727 -4.94469571 1.03360838
