program: Gaussian 16
title: Cl4F_isomer_48_0 opt
version: ES64L-G16RevC.02
basis: CBSB1
frameworkgroup: C1[X(C10H4ClF4)]
method: RHF
basis: STO-3G
operation: FOpt
keyword: #P
keyword: opt
keyword: EmpiricalDispersion=GD3BJ
keyword: integral(grid=ultrafinegrid)
keyword: GFInput
keyword: pop=full
keyword: IOP(3/74=-78)
keyword: IOP(6/7=3)
keyword: IOP(3/5=10)
keyword: IOP(3/175=01217700)
keyword: IOP(3/177=414500)
keyword: IOP(3/178=4859300)
keyword: SCF=YQC
title: #P opt EmpiricalDispersion=GD3BJ integral(grid=ultrafinegrid) GFInput
nucrepener: 1044.3140168506
basis: NPDir=0 NMtPBC= 1 NCelOv= 1 NCel= 1 NClECP= 1 NCelD= 1
basis: NCelK= 1 NCelE2= 1 NClLst= 1 CellRange= 0.0.
basis: One-electron integrals computed using PRISM.
basis: One-electron integral symmetry used in STVInt
basis: NBasis= 554 RedAO= T EigKep= 1.59D-06 NBF= 554
basis: NBsUse= 551 1.00D-06 EigRej= 8.63D-07 NBFU= 551
converged: YES YES YES YES
title: Mulliken charges:
elementType: C C C C C C C C C C F F F F H H H H Cl
charge: 0.211654 -0.198162 -0.365113 -0.017939 0.059882 0.068784 0.263987 0.262677 0.574734 -0.256727 -0.291963 -0.288646 -0.242337 -0.242584 0.140065 0.007360 0.132778 0.149172 -0.967622
chargesum: -1.00000
charge: 0.539793 0.354829 -0.374342 -0.016186 -0.374358 -0.016225 0.220467 0.036021 0.220400 0.036070 -0.298989 -0.298988 -0.243131 -0.243133 0.028322 0.028371 0.167599 0.167590 -0.934110
dipole: -12.7379 -0.0007 -0.0006
dipole: 12.7379
quadrupole: -186.1097 -101.0981 -94.3551
quadrupole: -0.0047 -0.0019 -0.0005
quadrupole: -58.9221 26.0896 32.8325 -0.0047 -0.0019 -0.0005
hfenergy: -1242.0008359 hartree
pointgroup: C01 [X(C10H4Cl1F4)]
dipole: 4.97864 -0.5727983 -0.0034588 debye
InChI: InChI=1/10C.Cl.4F.4H
charge -1 multiplicity 1
19 atoms
C  0.89645257 0.07644423 -0.00078733
C  -0.5108028 0.23841982 0.00031066
C  -1.35282299 -0.89132846 0.0025863
C  1.69157599 1.23518651 -0.00306264
C  -1.07414192 1.52992132 -0.00083484
C  1.40752932 -1.2326409 0.00047414
C  -0.8199954 -2.14076123 0.00374611
C  1.11365002 2.46238968 -0.00410388
C  -0.27140423 2.62563579 -0.00299402
C  0.56592748 -2.29646433 0.00267582
F  3.01420652 1.15063101 -0.00418597
F  2.71479726 -1.45078158 -0.00047727
F  1.89205781 3.53719592 -0.00622473
F  1.07978122 -3.52000421 0.00382083
H  -2.42474159 -0.71502679 0.00329877
H  -2.15808132 1.60181838 0.00007836
H  -1.43953523 -3.02349031 0.00548546
H  -0.67420237 3.62602657 -0.00380268
Cl -4.43499434 0.68988958 0.00307891
