program: Gaussian 16
title: Cl5F_isomer_53_0 opt
version: ES64L-G16RevC.02
basis: CBSB1
frameworkgroup: C1[X(C10H3ClF5)]
method: RHF
basis: STO-3G
operation: FOpt
keyword: #P
keyword: opt
keyword: EmpiricalDispersion=GD3BJ
keyword: integral(grid=ultrafinegrid)
keyword: GFInput
keyword: pop=full
keyword: IOP(3/74=-78)
keyword: IOP(6/7=3)
keyword: IOP(3/5=10)
keyword: IOP(3/175=01217700)
keyword: IOP(3/177=414500)
keyword: IOP(3/178=4859300)
keyword: SCF=YQC
title: #P opt EmpiricalDispersion=GD3BJ integral(grid=ultrafinegrid) GFInput
nucrepener: 1314.9821262228
basis: NPDir=0 NMtPBC= 1 NCelOv= 1 NCel= 1 NClECP= 1 NCelD= 1
basis: NCelK= 1 NCelE2= 1 NClLst= 1 CellRange= 0.0.
basis: One-electron integrals computed using PRISM.
basis: One-electron integral symmetry used in STVInt
basis: NBasis= 582 RedAO= T EigKep= 1.16D-06 NBF= 582
basis: NBsUse= 580 1.00D-06 EigRej= 5.05D-07 NBFU= 580
converged: YES YES YES YES
title: Mulliken charges:
elementType: C C C C C C C C C C F F F F F H H H Cl
charge: 0.088699 0.231215 -0.104614 0.225714 0.344530 -0.326061 0.453822 -0.010706 0.477659 -0.148499 -0.305589 -0.270188 -0.311929 -0.296421 -0.289025 0.112334 0.117730 0.086441 -1.075114
chargesum: -1.00000
charge: 0.115363 0.168455 -0.206837 0.297630 0.181568 -0.309633 0.473669 0.028977 0.363888 -0.158750 -0.263416 -0.258138 -0.281952 -0.255654 -0.250487 0.123734 0.125294 0.095456 -0.989168
dipole: 4.1249 -0.3050 -10.4384
dipole: 11.2280
quadrupole: -104.0089 -106.0159 -131.9219
quadrupole: 6.3014 7.0709 -6.1411
quadrupole: 9.9733 7.9663 -17.9396 6.3014 7.0709 -6.1411
hfenergy: -1341.1207232 hartree
pointgroup: C01 [X(C10H3Cl1F5)]
dipole: 1.3459245 0.3245274 -4.194856 debye
InChI: InChI=1/10C.Cl.5F.3H
charge -1 multiplicity 1
19 atoms
C  0.73008597 -0.35318006 -0.08516268
C  0.36094143 1.00996241 -0.07309179
C  -0.99952554 1.33798077 -0.08166026
C  2.10509302 -0.63872461 -0.06625925
C  -0.28097343 -1.32580597 -0.09316253
C  1.34530313 2.01069605 -0.03654642
C  -1.95247799 0.38165287 -0.09618017
C  3.0502981 0.32977178 -0.03224262
C  -1.58512725 -0.96580477 -0.09939348
C  2.6599334 1.67446877 -0.01411893
F  -1.35888441 2.60841249 -0.0709657
F  2.49916035 -1.90421399 -0.0838632
F  0.01093163 -2.61168007 -0.09519774
F  -3.23105409 0.68679917 -0.09554833
F  -2.53554267 -1.87583362 -0.10406657
H  1.03355691 3.04047389 0.00097386
H  4.08894092 0.04208987 -0.0058966
H  3.41554092 2.44320929 0.03192484
Cl -0.52595906 0.28346459 3.10046156
