program: Gaussian 16
title: Cl1F_isomer_3_0 opt
version: ES64L-G16RevC.02
basis: CBSB1
frameworkgroup: C1[X(C10H7ClF)]
method: RHF
basis: STO-3G
operation: FOpt
keyword: #P
keyword: opt
keyword: EmpiricalDispersion=GD3BJ
keyword: integral(grid=ultrafinegrid)
keyword: GFInput
keyword: pop=full
keyword: IOP(3/74=-78)
keyword: IOP(6/7=3)
keyword: IOP(3/5=10)
keyword: IOP(3/175=01217700)
keyword: IOP(3/177=414500)
keyword: IOP(3/178=4859300)
keyword: SCF=YQC
title: #P opt EmpiricalDispersion=GD3BJ integral(grid=ultrafinegrid) GFInput
nucrepener: 738.0313411871
basis: NPDir=0 NMtPBC= 1 NCelOv= 1 NCel= 1 NClECP= 1 NCelD= 1
basis: NCelK= 1 NCelE2= 1 NClLst= 1 CellRange= 0.0.
basis: One-electron integrals computed using PRISM.
basis: One-electron integral symmetry used in STVInt
basis: NBasis= 470 RedAO= T EigKep= 1.38D-06 NBF= 470
basis: NBsUse= 468 1.00D-06 EigRej= 4.27D-07 NBFU= 468
converged: YES YES YES YES
title: Mulliken charges:
elementType: C C C C C C C C C C F H H H H H H H Cl
charge: 0.396713 -0.158860 -0.453808 -0.237544 -0.453618 -0.160643 0.293774 0.024128 -0.066616 0.218331 -0.274466 0.074523 0.100298 0.067485 0.207701 0.081499 0.083839 0.226964 -0.969700
chargesum: -1.00000
charge: 0.903043 0.212807 -1.041893 -0.139994 -0.377902 -0.552614 0.191031 -0.016223 -0.070276 0.410937 -0.244590 0.078953 0.111319 0.083806 0.084877 0.094704 0.097108 0.136447 -0.961538
dipole: 17.8317 -0.2347 0.0006
dipole: 17.8333
quadrupole: -171.2289 -79.8229 -84.7183
quadrupole: -4.5120 -0.0032 -0.0002
quadrupole: -59.3056 32.1005 27.2051 -4.5120 -0.0032 -0.0002
hfenergy: -944.5695047 hartree
pointgroup: C01 [X(C10H7Cl1F1)]
dipole: -6.7509165 -1.6266609 -1.0026889 debye
InChI: InChI=1/10C.Cl.F.7H
charge -1 multiplicity 1
19 atoms
C  -0.15672454 -0.47316607 0.05121274
C  -0.48043893 0.90184324 0.07143276
C  0.54529052 1.84963157 0.25683238
C  -1.17422971 -1.42670705 -0.13331394
C  -1.82984681 1.2686026 -0.09656299
C  1.19475924 -0.82393338 0.22024461
C  1.83549728 1.45152696 0.41525666
C  -2.46760986 -1.0341666 -0.29240865
C  -2.79905908 0.33017861 -0.27374948
C  2.17522141 0.08744964 0.39770804
F  1.48601071 -2.12636635 0.1989579
H  0.28818041 2.89883585 0.27086047
H  -0.90971078 -2.47203434 -0.14616293
H  -2.08258812 2.31909743 -0.08185433
H  2.65680327 2.14031785 0.56040405
H  -3.24295649 -1.77218755 -0.43355476
H  -3.82798888 0.63249153 -0.40078041
H  3.2148935 -0.1788628 0.52791117
Cl 5.21292336 1.64564835 0.88756668
