program: Gaussian 16
title: Cl2F_isomer_5_0 opt
version: ES64L-G16RevC.02
basis: CBSB1
frameworkgroup: C1[X(C10H6ClF2)]
method: RHF
basis: STO-3G
operation: FOpt
keyword: #P
keyword: opt
keyword: EmpiricalDispersion=GD3BJ
keyword: integral(grid=ultrafinegrid)
keyword: GFInput
keyword: pop=full
keyword: IOP(3/74=-78)
keyword: IOP(6/7=3)
keyword: IOP(3/5=10)
keyword: IOP(3/175=01217700)
keyword: IOP(3/177=414500)
keyword: IOP(3/178=4859300)
keyword: SCF=YQC
title: #P opt EmpiricalDispersion=GD3BJ integral(grid=ultrafinegrid) GFInput
nucrepener: 901.3879231907
basis: NPDir=0 NMtPBC= 1 NCelOv= 1 NCel= 1 NClECP= 1 NCelD= 1
basis: NCelK= 1 NCelE2= 1 NClLst= 1 CellRange= 0.0.
basis: One-electron integrals computed using PRISM.
basis: One-electron integral symmetry used in STVInt
basis: NBasis= 498 RedAO= T EigKep= 1.77D-06 NBF= 498
basis: NBsUse= 495 1.00D-06 EigRej= 9.57D-07 NBFU= 495
converged: YES YES YES YES
title: Mulliken charges:
elementType: C C C C C C C C C C F F H H H H H H Cl
charge: 1.145200 1.397567 -0.490523 -0.628085 -0.180843 -0.850430 -0.188100 -0.312990 0.335945 -0.189922 -0.296511 -0.267659 0.110114 0.131589 0.083740 0.071106 0.126411 0.084296 -1.080904
chargesum: -1.00000
charge: 0.314478 0.126036 -0.665563 -0.080266 -0.426582 -0.251830 -0.582499 -0.048163 1.361752 -0.004425 -0.220339 -0.191060 0.100248 0.119963 0.075812 0.095827 0.149862 0.102555 -0.975807
dipole: -18.3741 -2.5577 0.0670
dipole: 18.5514
quadrupole: -169.5363 -86.9105 -87.9587
quadrupole: -9.6577 0.3710 0.0619
quadrupole: -54.7345 27.8914 26.8431 -9.6577 0.3710 0.0619
hfenergy: -1043.7116723 hartree
pointgroup: C01 [X(C10H6Cl1F2)]
dipole: -6.285251 -3.1651127 -1.9361037 debye
InChI: InChI=1/10C.Cl.2F.6H
charge -1 multiplicity 1
19 atoms
C  -0.7058177 0.38639104 0.12391499
C  -0.58472836 -1.00263161 -0.09271424
C  0.66394921 -1.62131591 0.08893737
C  -1.95123869 1.01301107 -0.05612071
C  0.44860113 1.09095176 0.51728493
C  -1.73300735 -1.7209641 -0.47845349
C  1.72384161 -0.86617623 0.46973147
C  -3.04050957 0.28953955 -0.43337546
C  1.65807187 0.51247696 0.69807369
C  -2.92828582 -1.09391302 -0.64532694
F  0.30749745 2.39267425 0.71326009
F  2.89141733 -1.46085022 0.63685576
H  0.78616631 -2.68115057 -0.06951705
H  -2.02480147 2.07541944 0.11211185
H  -1.6454783 -2.78515535 -0.64272067
H  -3.99339282 0.77782281 -0.56939599
H  2.54877113 1.08141967 0.9987163
H  -3.79747633 -1.66162558 -0.94231787
Cl 4.43275586 2.16425838 1.57105596
