program: Gaussian 16
title: Cl3F_isomer_22_0 opt
version: ES64L-G16RevC.02
basis: CBSB1
frameworkgroup: C1[X(C10H5ClF3)]
method: RHF
basis: STO-3G
operation: FOpt
keyword: #P
keyword: opt
keyword: EmpiricalDispersion=GD3BJ
keyword: integral(grid=ultrafinegrid)
keyword: GFInput
keyword: pop=full
keyword: IOP(3/74=-78)
keyword: IOP(6/7=3)
keyword: IOP(3/5=10)
keyword: IOP(3/175=01217700)
keyword: IOP(3/177=414500)
keyword: IOP(3/178=4859300)
keyword: SCF=YQC
title: #P opt EmpiricalDispersion=GD3BJ integral(grid=ultrafinegrid) GFInput
nucrepener: 963.0965462523
basis: NPDir=0 NMtPBC= 1 NCelOv= 1 NCel= 1 NClECP= 1 NCelD= 1
basis: NCelK= 1 NCelE2= 1 NClLst= 1 CellRange= 0.0.
basis: One-electron integrals computed using PRISM.
basis: One-electron integral symmetry used in STVInt
basis: NBasis= 526 RedAO= T EigKep= 1.15D-06 NBF= 526
basis: NBsUse= 524 1.00D-06 EigRej= 5.49D-07 NBFU= 524
converged: YES YES YES YES
title: Mulliken charges:
elementType: C C C C C C C C C C F F F H H H H H Cl
charge: 1.162900 -0.410493 -0.085271 -0.126703 -0.788717 0.046971 0.233415 0.346891 -0.023244 -0.312624 -0.288208 -0.237845 -0.269133 0.229871 0.102950 0.108280 0.223208 0.116645 -1.028891
chargesum: -1.00000
charge: 0.635483 0.000781 -0.220947 -0.156592 -0.412950 -0.516772 0.484082 0.143436 0.360739 -0.188932 -0.278804 -0.230757 -0.246615 0.016710 0.122493 0.155623 0.162729 0.129325 -0.959032
dipole: -15.0606 6.8298 0.0046
dipole: 16.5369
quadrupole: -160.5956 -117.5722 -91.1226
quadrupole: 27.6607 0.0214 -0.0103
quadrupole: -37.4988 5.5246 31.9742 27.6607 0.0214 -0.0103
hfenergy: -1142.859154 hartree
pointgroup: C01 [X(C10H5Cl1F3)]
dipole: -2.4581006 5.8926188 -1.2506698 debye
InChI: InChI=1/10C.Cl.3F.5H
charge -1 multiplicity 1
19 atoms
C  0.00748395 0.5923246 -0.08009697
C  -0.4085902 -0.73210908 0.18884063
C  0.55385839 -1.7330197 0.40975636
C  -0.95337001 1.59632219 -0.30162752
C  -1.79000155 -1.01011743 0.22735998
C  1.38333288 0.85409973 -0.11542061
C  1.88011949 -1.4391653 0.36707558
C  -2.27959104 1.30129867 -0.25879727
C  2.28865805 -0.1324684 0.10163438
C  -2.67463042 -0.01261386 0.00822234
F  1.79713319 2.09283811 -0.36667019
F  -3.98414212 -0.26400882 0.04223725
F  3.58094917 0.15910322 0.05891236
H  0.28586278 -2.76081105 0.61907525
H  -0.62500233 2.60268608 -0.50579744
H  -2.13028005 -2.01314732 0.43064061
H  2.59177037 -2.23481608 0.54172463
H  -3.03423726 2.05352029 -0.4252632
Cl 1.78342872 -4.79783936 1.05819385
