program: Gaussian 16
title: Cl4F_isomer_30_1 opt
version: ES64L-G16RevC.02
basis: CBSB1
frameworkgroup: C1[X(C10H4ClF4)]
method: RHF
basis: STO-3G
operation: FOpt
keyword: #P
keyword: opt
keyword: EmpiricalDispersion=GD3BJ
keyword: integral(grid=ultrafinegrid)
keyword: GFInput
keyword: pop=full
keyword: IOP(3/74=-78)
keyword: IOP(6/7=3)
keyword: IOP(3/5=10)
keyword: IOP(3/175=01217700)
keyword: IOP(3/177=414500)
keyword: IOP(3/178=4859300)
keyword: SCF=YQC
title: #P opt EmpiricalDispersion=GD3BJ integral(grid=ultrafinegrid) GFInput
nucrepener: 1087.5017459947
basis: NPDir=0 NMtPBC= 1 NCelOv= 1 NCel= 1 NClECP= 1 NCelD= 1
basis: NCelK= 1 NCelE2= 1 NClLst= 1 CellRange= 0.0.
basis: One-electron integrals computed using PRISM.
basis: One-electron integral symmetry used in STVInt
basis: NBasis= 554 RedAO= T EigKep= 1.80D-06 NBF= 554
basis: NBsUse= 551 1.00D-06 EigRej= 9.95D-07 NBFU= 551
converged: YES YES YES YES
title: Mulliken charges:
elementType: C C C C C C C C C C F F F F H H H H Cl
charge: 0.513425 0.733226 -0.712020 0.447713 -0.547054 -0.202150 -0.095534 0.230848 0.369971 -0.340983 -0.269509 -0.244596 -0.283442 -0.244608 0.101376 0.243663 0.094136 0.216983 -1.011446
chargesum: -1.00000
charge: 0.146480 0.232929 -0.595621 0.362941 -0.375531 -0.123930 -0.083221 0.658097 0.472360 -0.226703 -0.239749 -0.237796 -0.275133 -0.220055 0.110776 0.106583 0.107080 0.142246 -0.961752
dipole: 15.6264 7.7514 -0.0006
dipole: 17.4433
quadrupole: -186.3127 -112.1369 -94.4427
quadrupole: -25.3568 0.0027 0.0013
quadrupole: -55.3486 18.8272 36.5214 -25.3568 0.0027 0.0013
hfenergy: -1241.997142 hartree
pointgroup: C01 [X(C10H4Cl1F4)]
dipole: -3.8086721 -5.5631197 -1.2815724 debye
InChI: InChI=1/10C.Cl.4F.4H
charge -1 multiplicity 1
19 atoms
C  0.23695241 0.5284363 0.18606545
C  0.46347535 -0.84123721 -0.0815723
C  -0.62883586 -1.70450065 -0.30089573
C  1.32417816 1.3940472 0.40564833
C  -1.09394456 0.97738164 0.22226895
C  1.78809148 -1.30601424 -0.12124248
C  -1.88633365 -1.21492123 -0.253467
C  2.59884252 0.92258975 0.36261463
C  -2.13727353 0.13664344 0.00950914
C  2.80129479 -0.43050956 0.09732148
F  -1.34678242 2.24394543 0.46798165
F  -2.93551021 -1.99848022 -0.45490289
F  -3.38497048 0.5685589 0.04567928
F  4.04943414 -0.88518572 0.05658765
H  -0.47369084 -2.75164252 -0.50624999
H  1.19140102 2.44640371 0.61300524
H  2.00153254 -2.34404919 -0.32237375
H  3.40913032 1.62005626 0.53690434
Cl 3.31249933 4.11164992 1.03711801
