program: Gaussian 16
title: Cl4F_isomer_31_0 opt
version: ES64L-G16RevC.02
basis: CBSB1
frameworkgroup: C1[X(C10H4ClF4)]
method: RHF
basis: STO-3G
operation: FOpt
keyword: #P
keyword: opt
keyword: EmpiricalDispersion=GD3BJ
keyword: integral(grid=ultrafinegrid)
keyword: GFInput
keyword: pop=full
keyword: IOP(3/74=-78)
keyword: IOP(6/7=3)
keyword: IOP(3/5=10)
keyword: IOP(3/175=01217700)
keyword: IOP(3/177=414500)
keyword: IOP(3/178=4859300)
keyword: SCF=YQC
title: #P opt EmpiricalDispersion=GD3BJ integral(grid=ultrafinegrid) GFInput
nucrepener: 1046.7942155961
basis: NPDir=0 NMtPBC= 1 NCelOv= 1 NCel= 1 NClECP= 1 NCelD= 1
basis: NCelK= 1 NCelE2= 1 NClLst= 1 CellRange= 0.0.
basis: One-electron integrals computed using PRISM.
basis: One-electron integral symmetry used in STVInt
basis: NBasis= 554 RedAO= T EigKep= 1.48D-06 NBF= 554
basis: NBsUse= 551 1.00D-06 EigRej= 9.98D-07 NBFU= 551
converged: YES YES YES YES
title: Mulliken charges:
elementType: C C C C C C C C C C F F F F H H H H Cl
charge: 0.426682 0.563602 -0.156881 -0.246975 0.095598 -0.367842 0.479030 -0.165545 -0.069248 -0.173343 -0.265403 -0.200199 -0.267754 -0.190546 0.143736 0.121637 0.135750 0.102930 -0.965230
chargesum: -1.00000
charge: 0.450011 0.530841 -0.191250 -0.300308 0.313785 -0.344571 0.485347 -0.225936 -0.175285 -0.154920 -0.270064 -0.164668 -0.268973 -0.210749 0.134986 0.119185 0.132967 0.101164 -0.961559
dipole: 16.1714 3.1293 -0.0013
dipole: 16.4714
quadrupole: -173.5064 -98.0783 -94.5576
quadrupole: 0.1607 0.0049 0.0002
quadrupole: -51.4589 23.9691 27.4898 0.1607 0.0049 0.0002
hfenergy: -1241.9893504 hartree
pointgroup: C01 [X(C10H4Cl1F4)]
dipole: -0.0876667 -6.1320049 -2.0942568 debye
InChI: InChI=1/10C.Cl.4F.4H
charge -1 multiplicity 1
19 atoms
C  -0.88769622 0.7796341 -0.14617594
C  -0.43728753 -0.47377818 -0.62033307
C  0.94150956 -0.62923636 -0.80863309
C  -2.27841861 0.91524408 0.03643763
C  0.00504413 1.83483583 0.12855739
C  -1.34433615 -1.51621171 -0.88921298
C  1.80473898 0.38014768 -0.54677848
C  -3.15343878 -0.08900855 -0.22241474
C  1.32348619 1.61178125 -0.07701322
C  -2.67403144 -1.3198417 -0.69162683
F  1.41323816 -1.78703315 -1.25215837
F  -2.73556538 2.06274255 0.47506897
F  3.10033789 0.21643903 -0.72975784
F  2.23209298 2.53475769 0.15075977
H  -0.33074845 2.81363018 0.49720685
H  -0.96832185 -2.45953536 -1.24962793
H  -4.20558317 0.0816418 -0.06083279
H  -3.37436725 -2.11528011 -0.89593997
Cl -0.71291208 4.90683797 1.25201863
