program: Gaussian 16
title: Cl4F_isomer_46_0 opt
version: ES64L-G16RevC.02
basis: CBSB1
frameworkgroup: C1[X(C10H4ClF4)]
method: RHF
basis: STO-3G
operation: FOpt
keyword: #P
keyword: opt
keyword: EmpiricalDispersion=GD3BJ
keyword: integral(grid=ultrafinegrid)
keyword: GFInput
keyword: pop=full
keyword: IOP(3/74=-78)
keyword: IOP(6/7=3)
keyword: IOP(3/5=10)
keyword: IOP(3/175=01217700)
keyword: IOP(3/177=414500)
keyword: IOP(3/178=4859300)
keyword: SCF=YQC
title: #P opt EmpiricalDispersion=GD3BJ integral(grid=ultrafinegrid) GFInput
nucrepener: 1071.0373100978
basis: NPDir=0 NMtPBC= 1 NCelOv= 1 NCel= 1 NClECP= 1 NCelD= 1
basis: NCelK= 1 NCelE2= 1 NClLst= 1 CellRange= 0.0.
basis: One-electron integrals computed using PRISM.
basis: One-electron integral symmetry used in STVInt
basis: NBasis= 554 RedAO= T EigKep= 1.05D-06 NBF= 554
basis: NBsUse= 552 1.00D-06 EigRej= 5.36D-07 NBFU= 552
converged: YES YES YES YES
title: Mulliken charges:
elementType: C C C C C C C C C C F F F F H H H H Cl
charge: 0.653984 -0.536371 0.046641 -0.228249 -0.500462 0.126442 0.483084 0.380094 -0.080291 0.075620 -0.256366 -0.276441 -0.248577 -0.250693 0.106967 0.200567 0.178584 0.127614 -1.002148
chargesum: -1.00000
charge: -0.049820 -0.347071 -0.142124 -0.245238 0.028806 0.272562 0.546973 0.390039 -0.122966 0.155953 -0.248720 -0.276445 -0.232556 -0.246319 0.113434 0.101821 0.135783 0.132080 -0.966192
dipole: 15.6544 -7.9164 0.0000
dipole: 17.5423
quadrupole: -167.0308 -123.7190 -94.4187
quadrupole: 26.6688 0.0000 -0.0000
quadrupole: -38.6413 4.6705 33.9708 26.6688 0.0000 -0.0000
hfenergy: -1241.9969833 hartree
pointgroup: C01 [X(C10H4Cl1F4)]
dipole: 2.5092464 -6.1969944 -1.7128214 debye
InChI: InChI=1/10C.Cl.4F.4H
charge -1 multiplicity 1
19 atoms
C  -0.25694082 -0.74343452 -0.07840706
C  0.32661619 0.5061045 0.23401092
C  -0.48528029 1.60879092 0.54983801
C  0.55285914 -1.84979212 -0.39513268
C  1.73001817 0.58344784 0.21199734
C  -1.6546104 -0.82555758 -0.05783167
C  -1.83967912 1.48428653 0.55794359
C  1.90568065 -1.72613465 -0.4033835
C  -2.41729084 0.25374871 0.25035503
C  2.4898108 -0.49641226 -0.09621986
F  2.31775945 1.72737968 0.49636673
F  -2.23137077 -1.98687743 -0.34712607
F  -3.73389189 0.1239068 0.25586674
F  3.81289038 -0.39243274 -0.10878413
H  0.08790181 -2.79277907 -0.63015608
H  -0.07078358 2.5752581 0.79260512
H  -2.43106677 2.36072961 0.80735051
H  2.55180595 -2.55595054 -0.64211622
Cl -1.93463507 4.6719664 1.40282328
