program: Gaussian 16
title: Cl5F_isomer_50_1 opt
version: ES64L-G16RevC.02
basis: CBSB1
frameworkgroup: C1[X(C10H3ClF5)]
method: RHF
basis: STO-3G
operation: FOpt
keyword: #P
keyword: opt
keyword: EmpiricalDispersion=GD3BJ
keyword: integral(grid=ultrafinegrid)
keyword: GFInput
keyword: pop=full
keyword: IOP(3/74=-78)
keyword: IOP(6/7=3)
keyword: IOP(3/5=10)
keyword: IOP(3/175=01217700)
keyword: IOP(3/177=414500)
keyword: IOP(3/178=4859300)
keyword: SCF=YQC
title: #P opt EmpiricalDispersion=GD3BJ integral(grid=ultrafinegrid) GFInput
nucrepener: 1156.4306175862
basis: NPDir=0 NMtPBC= 1 NCelOv= 1 NCel= 1 NClECP= 1 NCelD= 1
basis: NCelK= 1 NCelE2= 1 NClLst= 1 CellRange= 0.0.
basis: One-electron integrals computed using PRISM.
basis: One-electron integral symmetry used in STVInt
basis: NBasis= 582 RedAO= T EigKep= 1.12D-06 NBF= 582
basis: NBsUse= 580 1.00D-06 EigRej= 4.41D-07 NBFU= 580
converged: YES YES YES YES
title: Mulliken charges:
elementType: C C C C C C C C C C F F F F F H H H Cl
charge: -0.083759 0.138846 -0.096605 0.128810 -0.287572 0.388568 0.505012 0.454328 0.183376 -0.406720 -0.268300 -0.291980 -0.263526 -0.230693 -0.229423 0.056315 0.142335 0.116688 -0.955700
chargesum: -1.00000
charge: 0.419937 0.418525 -0.338022 0.116863 -0.519677 0.040080 0.352671 0.237609 0.257484 -0.003232 -0.288322 -0.302455 -0.266509 -0.242952 -0.244331 0.016705 0.107265 0.171075 -0.932713
dipole: -11.9408 4.9768 -0.0019
dipole: 12.9364
quadrupole: -174.6328 -122.9313 -97.6097
quadrupole: 26.3882 -0.0042 0.0057
quadrupole: -42.9081 8.7933 34.1149 26.3882 -0.0042 0.0057
hfenergy: -1341.1407377 hartree
pointgroup: C01 [X(C10H3Cl1F5)]
dipole: 4.3770068 -2.5972112 0.0085339 debye
InChI: InChI=1/10C.Cl.5F.3H
charge -1 multiplicity 1
19 atoms
C  -0.18227872 0.64757439 -0.00069921
C  1.02974094 -0.08466873 0.00198147
C  -0.15028783 2.05673519 0.0048425
C  0.94684701 -1.48685211 -0.00399712
C  -1.42577613 -0.01644742 -0.00905034
C  2.23863013 0.63260412 0.01040731
C  -0.25714257 -2.1104588 -0.01207445
C  1.03854164 2.71298297 0.01269048
C  -1.44355802 -1.36508603 -0.01454599
C  2.23008692 1.98804322 0.01551414
F  2.03771842 -2.23473803 -0.00191554
F  3.40086843 -0.00308361 0.01335065
F  -0.32016562 -3.42836918 -0.01762679
F  -2.5722717 -2.05339513 -0.02245458
F  3.38645972 2.63898835 0.02326761
H  -1.10375999 2.577907 0.00276285
H  -2.33498665 0.58292521 -0.01037889
H  1.0896138 3.7903792 0.0164535
Cl -3.50861878 2.70288939 -0.0069806
