program: Gaussian 16
title: Cl5F_isomer_52_1 opt
version: ES64L-G16RevC.02
basis: CBSB1
frameworkgroup: C1[X(C10H3ClF5)]
method: RHF
basis: STO-3G
operation: FOpt
keyword: #P
keyword: opt
keyword: EmpiricalDispersion=GD3BJ
keyword: integral(grid=ultrafinegrid)
keyword: GFInput
keyword: pop=full
keyword: IOP(3/74=-78)
keyword: IOP(6/7=3)
keyword: IOP(3/5=10)
keyword: IOP(3/175=01217700)
keyword: IOP(3/177=414500)
keyword: IOP(3/178=4859300)
keyword: SCF=YQC
title: #P opt EmpiricalDispersion=GD3BJ integral(grid=ultrafinegrid) GFInput
nucrepener: 1228.9607266483
basis: NPDir=0 NMtPBC= 1 NCelOv= 1 NCel= 1 NClECP= 1 NCelD= 1
basis: NCelK= 1 NCelE2= 1 NClLst= 1 CellRange= 0.0.
basis: One-electron integrals computed using PRISM.
basis: One-electron integral symmetry used in STVInt
basis: NBasis= 582 RedAO= T EigKep= 1.35D-06 NBF= 582
basis: NBsUse= 580 1.00D-06 EigRej= 4.14D-07 NBFU= 580
converged: YES YES YES YES
title: Mulliken charges:
elementType: C C C C C C C C C C F F F F F H H H Cl
charge: -0.404901 0.125234 -0.302808 0.210569 0.293831 0.072851 0.103031 0.081467 0.443073 0.121787 -0.298577 -0.275127 -0.284375 -0.248848 -0.278488 0.121917 0.237484 0.236047 -0.954167
chargesum: -1.00000
charge: 0.052168 0.339995 -0.251668 0.033892 0.341546 -0.125853 0.058056 0.043410 0.308587 0.064358 -0.271757 -0.262505 -0.258266 -0.246507 -0.267070 0.133879 0.138828 0.137762 -0.968855
dipole: 17.9995 1.1969 -0.0028
dipole: 18.0392
quadrupole: -224.9368 -107.0955 -97.6566
quadrupole: 0.4741 0.0141 0.0002
quadrupole: -81.7071 36.1342 45.5730 0.4741 0.0141 0.0002
hfenergy: -1341.1391489 hartree
pointgroup: C01 [X(C10H3Cl1F5)]
dipole: -6.9889074 -0.7634946 -0.9706689 debye
InChI: InChI=1/10C.Cl.5F.3H
charge -1 multiplicity 1
19 atoms
C  0.26471607 0.56115344 0.06165883
C  0.4015523 -0.8477727 0.07211279
C  -0.72208377 -1.67897871 -0.08781516
C  1.42686622 1.33998474 0.22656244
C  -1.03067914 1.08057782 -0.11389716
C  1.68790156 -1.3820382 0.24636885
C  -1.93989707 -1.1221102 -0.25246858
C  2.64691449 0.78243998 0.39145337
C  -2.10603157 0.26609468 -0.26708482
C  2.78543578 -0.61226175 0.4024013
F  1.30469831 2.6622586 0.21757268
F  -1.24251721 2.37945976 -0.13547639
F  1.78651109 -2.71123897 0.25206494
F  -3.02398745 -1.86465662 -0.40643867
F  -3.31367677 0.77165921 -0.43065687
H  -0.61218611 -2.74978655 -0.07904987
H  3.5477277 1.36786068 0.51925053
H  3.78528896 -1.00577677 0.53808071
Cl 5.94582711 0.31206707 0.84536308
