program: Gaussian 16
title: Cl2F_isomer_10_0 opt
version: ES64L-G16RevC.02
basis: CBSB1
frameworkgroup: C1[X(C10H6ClF2)]
method: RHF
basis: STO-3G
operation: FOpt
keyword: #P
keyword: opt
keyword: EmpiricalDispersion=GD3BJ
keyword: integral(grid=ultrafinegrid)
keyword: GFInput
keyword: pop=full
keyword: IOP(3/74=-78)
keyword: IOP(6/7=3)
keyword: IOP(3/5=10)
keyword: IOP(3/175=01217700)
keyword: IOP(3/177=414500)
keyword: IOP(3/178=4859300)
keyword: SCF=YQC
title: #P opt EmpiricalDispersion=GD3BJ integral(grid=ultrafinegrid) GFInput
nucrepener: 846.7839530856
basis: NPDir=0 NMtPBC= 1 NCelOv= 1 NCel= 1 NClECP= 1 NCelD= 1
basis: NCelK= 1 NCelE2= 1 NClLst= 1 CellRange= 0.0.
basis: One-electron integrals computed using PRISM.
basis: One-electron integral symmetry used in STVInt
basis: NBasis= 498 RedAO= T EigKep= 1.37D-06 NBF= 498
basis: NBsUse= 496 1.00D-06 EigRej= 5.17D-07 NBFU= 496
converged: YES YES YES YES
title: Mulliken charges:
elementType: C C C C C C C C C C F F H H H H H H Cl
charge: 0.842112 -0.615790 -0.356580 -0.259423 -0.439664 -0.515989 1.183228 0.024018 0.022982 -0.095279 -0.279841 -0.251907 0.095777 0.097880 0.073002 0.308244 0.085650 0.086942 -1.005361
chargesum: -1.00000
charge: 0.793317 -0.004579 -0.219815 -0.250766 -0.599899 -0.372574 0.537664 -0.225343 0.341028 -0.139872 -0.278743 -0.243165 0.008469 0.117923 0.135511 0.165811 0.094106 0.101300 -0.960372
dipole: 16.0410 1.3493 0.0005
dipole: 16.0977
quadrupole: -163.6321 -93.0240 -87.9361
quadrupole: -18.7624 -0.0020 -0.0004
quadrupole: -48.7681 21.8401 26.9280 -18.7624 -0.0020 -0.0004
hfenergy: -1043.7115121 hartree
pointgroup: C01 [X(C10H6Cl1F2)]
dipole: -3.0136106 -5.441245 -1.1924167 debye
InChI: InChI=1/10C.Cl.2F.6H
charge -1 multiplicity 1
19 atoms
C  -0.39801801 -0.56609083 -0.0765599
C  -0.63937525 0.8019321 0.18621207
C  0.44196813 1.67571009 0.40002955
C  -1.48194249 -1.43971243 -0.29039537
C  0.93319752 -0.99890589 -0.11303643
C  -1.97519743 1.24785068 0.22511062
C  1.72062591 1.21739291 0.35661828
C  -2.75695055 -0.96920172 -0.24432274
C  1.95655617 -0.13229261 0.09718385
C  -3.00838472 0.38892641 0.01607589
F  1.19102374 -2.28122068 -0.35824806
F  3.20145062 -0.58611798 0.05329447
H  0.3041194 2.73055309 0.60436832
H  -1.28418804 -2.48095427 -0.48985763
H  -2.15432409 2.29342788 0.42611595
H  2.5317112 1.9117544 0.52449721
H  -3.58433094 -1.64335047 -0.40897082
H  -4.02623693 0.74711437 0.04936882
Cl 1.91210074 4.63712793 1.04251592
