program: Gaussian 16
title: Cl3F_isomer_22_1 opt
version: ES64L-G16RevC.02
basis: CBSB1
frameworkgroup: C1[X(C10H5ClF3)]
method: RHF
basis: STO-3G
operation: FOpt
keyword: #P
keyword: opt
keyword: EmpiricalDispersion=GD3BJ
keyword: integral(grid=ultrafinegrid)
keyword: GFInput
keyword: pop=full
keyword: IOP(3/74=-78)
keyword: IOP(6/7=3)
keyword: IOP(3/5=10)
keyword: IOP(3/175=01217700)
keyword: IOP(3/177=414500)
keyword: IOP(3/178=4859300)
keyword: SCF=YQC
title: #P opt EmpiricalDispersion=GD3BJ integral(grid=ultrafinegrid) GFInput
nucrepener: 917.9636539053
basis: NPDir=0 NMtPBC= 1 NCelOv= 1 NCel= 1 NClECP= 1 NCelD= 1
basis: NCelK= 1 NCelE2= 1 NClLst= 1 CellRange= 0.0.
basis: One-electron integrals computed using PRISM.
basis: One-electron integral symmetry used in STVInt
basis: NBasis= 526 RedAO= T EigKep= 1.36D-06 NBF= 526
basis: NBsUse= 523 1.00D-06 EigRej= 6.05D-07 NBFU= 523
converged: YES YES YES YES
title: Mulliken charges:
elementType: C C C C C C C C C C F F F H H H H H Cl
charge: 0.074230 0.681557 -0.446160 0.618442 -0.045352 -0.765240 0.132418 0.391552 -0.159936 -0.391338 -0.209094 -0.219006 -0.253092 0.084180 0.094242 0.106409 0.128722 0.147337 -0.969872
chargesum: -1.00000
charge: -0.179480 -0.132437 -0.470367 0.173349 0.347828 -0.203251 0.360898 0.677240 0.187065 -0.628171 -0.249637 -0.213634 -0.249753 0.075884 0.098113 0.107881 0.131551 0.136461 -0.969542
dipole: -15.5264 8.7057 0.0026
dipole: 17.8005
quadrupole: -162.2608 -110.5103 -91.1805
quadrupole: 22.9400 0.0098 -0.0048
quadrupole: -40.9436 10.8069 30.1367 22.9400 0.0098 -0.0048
hfenergy: -1142.855952 hartree
pointgroup: C01 [X(C10H5Cl1F3)]
dipole: -1.7945723 -6.7694179 0.0010204 debye
InChI: InChI=1/10C.Cl.3F.5H
charge -1 multiplicity 1
19 atoms
C  1.04202554 0.6905128 0.00005265
C  -0.16952245 -0.03896403 0.0002468
C  -0.13131336 -1.4465425 0.00039282
C  1.01440599 2.09802457 -0.00009516
C  -1.38279941 0.67141676 0.00028809
C  2.24520065 -0.03528387 0.00001366
C  1.05372311 -2.11188865 0.0003493
C  -0.17070068 2.76441843 -0.00005153
C  2.24812 -1.3914412 0.00015748
C  -1.3544985 2.02633108 0.00014133
F  3.39303346 0.61220416 -0.00016622
F  -2.50892092 2.68668546 0.000185
F  3.40008524 -2.05307458 0.00011664
H  -1.06037816 -1.99614435 0.00054064
H  1.9183407 2.68919028 -0.00024655
H  -2.32580395 0.1471561 0.00043531
H  1.10369192 -3.18934941 0.000459
H  -0.14868019 3.84842562 -0.00016564
Cl 1.73067 5.50258833 -0.00062062
