program: Gaussian 16
title: Cl4F_isomer_31_1 opt
version: ES64L-G16RevC.02
basis: CBSB1
frameworkgroup: C1[X(C10H4ClF4)]
method: RHF
basis: STO-3G
operation: FOpt
keyword: #P
keyword: opt
keyword: EmpiricalDispersion=GD3BJ
keyword: integral(grid=ultrafinegrid)
keyword: GFInput
keyword: pop=full
keyword: IOP(3/74=-78)
keyword: IOP(6/7=3)
keyword: IOP(3/5=10)
keyword: IOP(3/175=01217700)
keyword: IOP(3/177=414500)
keyword: IOP(3/178=4859300)
keyword: SCF=YQC
title: #P opt EmpiricalDispersion=GD3BJ integral(grid=ultrafinegrid) GFInput
nucrepener: 1086.5578373994
basis: NPDir=0 NMtPBC= 1 NCelOv= 1 NCel= 1 NClECP= 1 NCelD= 1
basis: NCelK= 1 NCelE2= 1 NClLst= 1 CellRange= 0.0.
basis: One-electron integrals computed using PRISM.
basis: One-electron integral symmetry used in STVInt
basis: NBasis= 554 RedAO= T EigKep= 1.31D-06 NBF= 554
basis: NBsUse= 552 1.00D-06 EigRej= 4.11D-07 NBFU= 552
converged: YES YES YES YES
title: Mulliken charges:
elementType: C C C C C C C C C C F F F F H H H H Cl
charge: 0.010253 -0.200824 -0.197592 0.144337 -0.336837 -0.119665 0.533910 0.158863 0.077400 0.287480 -0.260246 -0.278589 -0.284204 -0.248454 0.119162 0.110687 0.236179 0.210032 -0.961892
chargesum: -1.00000
charge: 0.353640 0.406448 -0.132133 0.171494 -0.305366 -0.493993 0.400817 0.052029 0.030467 0.031240 -0.248017 -0.249392 -0.273824 -0.246933 0.130536 0.112921 0.138634 0.090918 -0.969485
dipole: 18.2869 1.1514 -0.0006
dipole: 18.3231
quadrupole: -226.4548 -98.1372 -94.4166
quadrupole: -4.9585 0.0031 0.0003
quadrupole: -86.7852 41.5324 45.2529 -4.9585 0.0031 0.0003
hfenergy: -1241.9986752 hartree
pointgroup: C01 [X(C10H4Cl1F4)]
dipole: -6.9085065 -1.8021564 -0.9962013 debye
InChI: InChI=1/10C.Cl.4F.4H
charge -1 multiplicity 1
19 atoms
C  0.60696254 -0.56243778 0.06146507
C  0.25758796 0.80518418 0.07197574
C  -1.09956557 1.11977919 -0.09572529
C  1.96662975 -0.87473054 0.22959738
C  -0.37531702 -1.55499614 -0.11082737
C  1.24850533 1.78893373 0.24505425
C  -2.04431421 0.16092214 -0.26161428
C  2.92203207 0.06500748 0.39609963
C  -1.6650159 -1.18659206 -0.26729801
C  2.54777593 1.41876413 0.40273141
F  -1.4774375 2.38568451 -0.09325612
F  2.28610717 -2.16818111 0.21819872
F  -3.31641772 0.47764164 -0.41789763
F  -2.62461356 -2.08472478 -0.43263081
H  -0.10684368 -2.59772752 -0.11856282
H  0.96226138 2.82787362 0.25027021
H  3.97083359 -0.16778001 0.52615763
H  3.35261496 2.12800779 0.53958567
Cl 5.90410948 1.57131355 0.85667663
