program: Gaussian 16
title: Cl4F_isomer_34_1 opt
version: ES64L-G16RevC.02
basis: CBSB1
frameworkgroup: C1[X(C10H4ClF4)]
method: RHF
basis: STO-3G
operation: FOpt
keyword: #P
keyword: opt
keyword: EmpiricalDispersion=GD3BJ
keyword: integral(grid=ultrafinegrid)
keyword: GFInput
keyword: pop=full
keyword: IOP(3/74=-78)
keyword: IOP(6/7=3)
keyword: IOP(3/5=10)
keyword: IOP(3/175=01217700)
keyword: IOP(3/177=414500)
keyword: IOP(3/178=4859300)
keyword: SCF=YQC
title: #P opt EmpiricalDispersion=GD3BJ integral(grid=ultrafinegrid) GFInput
nucrepener: 1074.8132176847
basis: NPDir=0 NMtPBC= 1 NCelOv= 1 NCel= 1 NClECP= 1 NCelD= 1
basis: NCelK= 1 NCelE2= 1 NClLst= 1 CellRange= 0.0.
basis: One-electron integrals computed using PRISM.
basis: One-electron integral symmetry used in STVInt
basis: NBasis= 554 RedAO= T EigKep= 1.38D-06 NBF= 554
basis: NBsUse= 552 1.00D-06 EigRej= 5.25D-07 NBFU= 552
converged: YES YES YES YES
title: Mulliken charges:
elementType: C C C C C C C C C C F F F F H H H H Cl
charge: 0.111777 0.133212 -0.226044 0.089234 -0.102191 -0.554396 0.109071 1.119806 0.169157 -0.499027 -0.258076 -0.254498 -0.256685 -0.219173 0.101124 0.122569 0.086030 0.335340 -1.007229
chargesum: -1.00000
charge: 0.452901 0.043411 -0.142955 -0.423413 -0.082568 -0.576778 0.177870 1.366118 0.217159 -0.655799 -0.221695 -0.244110 -0.248413 -0.192867 0.112538 0.137314 0.098051 0.154432 -0.971194
dipole: 18.3429 4.0243 0.0072
dipole: 18.7792
quadrupole: -216.9161 -97.0685 -94.3761
quadrupole: -13.3143 -0.0348 -0.0082
quadrupole: -80.7959 39.0518 41.7441 -13.3143 -0.0348 -0.0082
hfenergy: -1242.0006888 hartree
pointgroup: C01 [X(C10H4Cl1F4)]
dipole: -6.5547189 -3.2157114 -1.1322181 debye
InChI: InChI=1/10C.Cl.4F.4H
charge -1 multiplicity 1
19 atoms
C  0.06580623 0.52709759 0.14019801
C  0.11373561 -0.87309987 -0.02467311
C  -1.09331608 -1.5643902 -0.24633943
C  1.28016864 1.20378814 0.36093184
C  -1.16605177 1.20252278 0.08196227
C  1.352128 -1.53168061 0.03635263
C  -2.26248507 -0.88793608 -0.29731397
C  2.48317233 0.58769498 0.42309953
C  -2.30130934 0.5020472 -0.13264447
C  2.47476213 -0.80003566 0.25330305
F  1.20198754 2.51545947 0.51158508
F  -3.40733429 -1.52237867 -0.5049758
F  -3.48124515 1.10351889 -0.19395154
F  3.63261162 -1.43233788 0.30835889
H  -1.09689399 -2.63521526 -0.37701138
H  -1.20817447 2.27178208 0.20724658
H  1.41848964 -2.60086189 -0.08614846
H  3.41872356 1.14153057 0.59696008
Cl 5.30005086 2.25984042 0.9430612
