program: Gaussian 16
title: Cl4F_isomer_37_0 opt
version: ES64L-G16RevC.02
basis: CBSB1
frameworkgroup: C1[X(C10H4ClF4)]
method: RHF
basis: STO-3G
operation: FOpt
keyword: #P
keyword: opt
keyword: EmpiricalDispersion=GD3BJ
keyword: integral(grid=ultrafinegrid)
keyword: GFInput
keyword: pop=full
keyword: IOP(3/74=-78)
keyword: IOP(6/7=3)
keyword: IOP(3/5=10)
keyword: IOP(3/175=01217700)
keyword: IOP(3/177=414500)
keyword: IOP(3/178=4859300)
keyword: SCF=YQC
title: #P opt EmpiricalDispersion=GD3BJ integral(grid=ultrafinegrid) GFInput
nucrepener: 1093.5917531715
basis: NPDir=0 NMtPBC= 1 NCelOv= 1 NCel= 1 NClECP= 1 NCelD= 1
basis: NCelK= 1 NCelE2= 1 NClLst= 1 CellRange= 0.0.
basis: One-electron integrals computed using PRISM.
basis: One-electron integral symmetry used in STVInt
basis: NBasis= 554 RedAO= T EigKep= 1.50D-06 NBF= 554
basis: NBsUse= 552 1.00D-06 EigRej= 5.60D-07 NBFU= 552
converged: YES YES YES YES
title: Mulliken charges:
elementType: C C C C C C C C C C F F F F H H H H Cl
charge: -0.236547 0.240449 -0.501790 0.082785 -0.459253 0.515599 -0.504618 -0.014769 1.068636 0.215465 -0.288240 -0.264491 -0.223545 -0.252398 0.091307 0.072651 0.338566 0.122170 -1.001975
chargesum: -1.00000
charge: 0.077923 0.239910 -0.522467 0.134461 -0.424042 0.011640 -0.585935 -0.034204 1.213773 0.327901 -0.273062 -0.232503 -0.194105 -0.243085 0.103209 0.081629 0.154568 0.135879 -0.971491
dipole: -18.3041 6.5033 -0.0415
dipole: 19.4252
quadrupole: -195.9363 -101.4319 -94.4499
quadrupole: 12.0678 -0.2472 0.0676
quadrupole: -65.3302 29.1741 36.1561 12.0678 -0.2472 0.0676
hfenergy: -1241.9930887 hartree
pointgroup: C01 [X(C10H4Cl1F4)]
dipole: 5.6834556 -4.9724236 -1.174862 debye
InChI: InChI=1/10C.Cl.4F.4H
charge -1 multiplicity 1
19 atoms
C  0.16014057 0.19879412 0.11502965
C  -0.23306794 -1.15648662 0.00044803
C  -1.59306335 -1.49047319 0.09817614
C  1.53157001 0.49840617 0.01214998
C  0.74797159 -2.14413251 -0.20959737
C  -0.85467842 1.15839836 0.32513751
C  -2.50403319 -0.50748313 0.30069005
C  2.44551286 -0.48451772 -0.19067587
C  -2.16826309 0.84250299 0.42062532
C  2.0628444 -1.81882713 -0.30392738
F  1.96409903 1.73870821 0.10976415
F  -0.49356161 2.42163937 0.43209191
F  -3.77796675 -0.8379391 0.38982829
F  3.73233358 -0.17154151 -0.28360003
H  -1.91183466 -2.51698945 0.01324418
H  0.43626814 -3.1735671 -0.29531006
H  -2.94214956 1.60893628 0.58616884
H  2.82665995 -2.56304129 -0.46466201
Cl -4.57074456 3.06188626 0.94442066
