program: Gaussian 16
title: Cl5F_isomer_54_1 opt
version: ES64L-G16RevC.02
basis: CBSB1
frameworkgroup: C1[X(C10H3ClF5)]
method: RHF
basis: STO-3G
operation: FOpt
keyword: #P
keyword: opt
keyword: EmpiricalDispersion=GD3BJ
keyword: integral(grid=ultrafinegrid)
keyword: GFInput
keyword: pop=full
keyword: IOP(3/74=-78)
keyword: IOP(6/7=3)
keyword: IOP(3/5=10)
keyword: IOP(3/175=01217700)
keyword: IOP(3/177=414500)
keyword: IOP(3/178=4859300)
keyword: SCF=YQC
title: #P opt EmpiricalDispersion=GD3BJ integral(grid=ultrafinegrid) GFInput
nucrepener: 1170.9117931605
basis: NPDir=0 NMtPBC= 1 NCelOv= 1 NCel= 1 NClECP= 1 NCelD= 1
basis: NCelK= 1 NCelE2= 1 NClLst= 1 CellRange= 0.0.
basis: One-electron integrals computed using PRISM.
basis: One-electron integral symmetry used in STVInt
basis: NBasis= 582 RedAO= T EigKep= 1.39D-06 NBF= 582
basis: NBsUse= 579 1.00D-06 EigRej= 9.92D-07 NBFU= 579
converged: YES YES YES YES
title: Mulliken charges:
elementType: C C C C C C C C C C F F F F F H H H Cl
charge: 0.499309 0.129916 -0.251854 -0.285603 0.016063 -0.046460 0.149264 0.722516 -0.137946 -0.035600 -0.271920 -0.242372 -0.267469 -0.114239 -0.250640 0.154484 0.097493 0.140540 -1.005482
chargesum: -1.00000
charge: 0.574107 0.345024 -0.207353 -0.266431 -0.581092 -0.123822 0.302434 0.461265 0.232270 0.157103 -0.277898 -0.248487 -0.273696 -0.239349 -0.250742 0.098640 0.098422 0.130992 -0.931387
dipole: -4.0331 13.1190 -0.0009
dipole: 13.7249
quadrupole: -126.5080 -165.0705 -97.5932
quadrupole: 16.3762 -0.0010 0.0034
quadrupole: 3.2159 -35.3466 32.1307 16.3762 -0.0010 0.0034
hfenergy: -1341.1462947 hartree
pointgroup: C01 [X(C10H3Cl1F5)]
dipole: 0.2416013 5.2980143 1.0150912 debye
InChI: InChI=1/10C.Cl.5F.3H
charge -1 multiplicity 1
19 atoms
C  0.06542928 0.66465441 -0.3031539
C  -0.02910762 -0.71804429 -0.56965665
C  1.15057093 -1.48590779 -0.66403931
C  -1.12434725 1.39860573 -0.21563697
C  -1.2867185 -1.33216771 -0.74092593
C  1.32464151 1.26789391 -0.13391316
C  2.34415349 -0.87618881 -0.49642718
C  -2.33023201 0.80481637 -0.38080015
C  -2.39763406 -0.57116705 -0.6448652
C  2.43073181 0.49855025 -0.2318018
F  -1.0707791 2.70062167 0.03377914
F  3.48210425 -1.546795 -0.57416581
F  -3.44478807 1.50768461 -0.29592446
F  -3.60919286 -1.08076442 -0.79432687
F  3.63555233 1.02922774 -0.07869219
H  1.06332474 -2.55213724 -0.87008585
H  -1.32445148 -2.40087112 -0.94532546
H  1.41572463 2.32163687 0.07000672
Cl -0.23621901 -4.51513314 -1.29858098
