program: Gaussian 16
title: Cl5F_isomer_63_1 opt
version: ES64L-G16RevC.02
basis: CBSB1
frameworkgroup: C1[X(C10H3ClF5)]
method: RHF
basis: STO-3G
operation: FOpt
keyword: #P
keyword: opt
keyword: EmpiricalDispersion=GD3BJ
keyword: integral(grid=ultrafinegrid)
keyword: GFInput
keyword: pop=full
keyword: IOP(3/74=-78)
keyword: IOP(6/7=3)
keyword: IOP(3/5=10)
keyword: IOP(3/175=01217700)
keyword: IOP(3/177=414500)
keyword: IOP(3/178=4859300)
keyword: SCF=YQC
title: #P opt EmpiricalDispersion=GD3BJ integral(grid=ultrafinegrid) GFInput
nucrepener: 1295.2152596477
basis: NPDir=0 NMtPBC= 1 NCelOv= 1 NCel= 1 NClECP= 1 NCelD= 1
basis: NCelK= 1 NCelE2= 1 NClLst= 1 CellRange= 0.0.
basis: One-electron integrals computed using PRISM.
basis: One-electron integral symmetry used in STVInt
basis: NBasis= 582 RedAO= T EigKep= 1.04D-06 NBF= 582
basis: NBsUse= 580 1.00D-06 EigRej= 5.82D-07 NBFU= 580
converged: YES YES YES YES
title: Mulliken charges:
elementType: C C C C C C C C C C F F F F F H H H Cl
charge: 0.651200 -0.294574 -0.493917 0.511170 0.131192 -0.200758 0.356447 0.143974 0.239155 0.041583 -0.261114 -0.312357 -0.299641 -0.278370 -0.243080 0.134898 0.143174 0.101416 -1.070398
chargesum: -1.00000
charge: 0.031750 -0.103541 -0.330992 0.158939 0.456231 -0.204883 0.226393 0.152544 0.657694 -0.236583 -0.207197 -0.290621 -0.295736 -0.232575 -0.235332 0.089667 0.161306 0.160999 -0.958062
dipole: -15.7669 -2.0945 -0.0022
dipole: 15.9054
quadrupole: -199.8810 -110.7898 -97.7102
quadrupole: -23.7314 -0.0084 -0.0026
quadrupole: -63.7540 25.3372 38.4168 -23.7314 -0.0084 -0.0026
hfenergy: -1341.1362284 hartree
pointgroup: C01 [X(C10H3Cl1F5)]
dipole: -2.6961742 -5.2700818 -2.0286085 debye
InChI: InChI=1/10C.Cl.5F.3H
charge -1 multiplicity 1
19 atoms
C  0.12966914 -0.47684687 -0.24014234
C  -0.14177341 0.81587978 0.27414798
C  -1.4906362 1.18042275 0.44236975
C  1.47655715 -0.83034934 -0.40419378
C  0.90516671 1.69329131 0.60046891
C  -0.94888854 -1.32670616 -0.5551722
C  -2.51948942 0.35643747 0.13655838
C  2.46780678 0.04331704 -0.07801835
C  2.196662 1.31029634 0.42610095
C  -2.22295355 -0.91048168 -0.36794202
F  -1.75632218 2.37757167 0.91900886
F  1.80699249 -2.02130494 -0.88004282
F  -0.73771184 -2.54071506 -1.03712301
F  3.7218514 -0.33925201 -0.2517791
F  -3.22585134 -1.72151378 -0.66900962
H  0.72975931 2.68929762 0.99532547
H  -3.54302497 0.66072772 0.2752782
H  2.98873497 1.99808508 0.68248288
Cl 1.94833881 4.60981387 1.73168086
