program: Gaussian 16
title: Cl7F_isomer_75_1 opt
version: ES64L-G16RevC.02
basis: CBSB1
frameworkgroup: C1[X(C10HClF7)]
method: RHF
basis: STO-3G
operation: FOpt
keyword: #P
keyword: opt
keyword: EmpiricalDispersion=GD3BJ
keyword: integral(grid=ultrafinegrid)
keyword: GFInput
keyword: pop=full
keyword: IOP(3/74=-78)
keyword: IOP(6/7=3)
keyword: IOP(3/5=10)
keyword: IOP(3/175=01217700)
keyword: IOP(3/177=414500)
keyword: IOP(3/178=4859300)
keyword: SCF=YQC
title: #P opt EmpiricalDispersion=GD3BJ integral(grid=ultrafinegrid) GFInput
nucrepener: 1519.9439623970
basis: NPDir=0 NMtPBC= 1 NCelOv= 1 NCel= 1 NClECP= 1 NCelD= 1
basis: NCelK= 1 NCelE2= 1 NClLst= 1 CellRange= 0.0.
basis: One-electron integrals computed using PRISM.
basis: One-electron integral symmetry used in STVInt
basis: NBasis= 638 RedAO= T EigKep= 1.23D-06 NBF= 638
basis: NBsUse= 636 1.00D-06 EigRej= 5.05D-07 NBFU= 636
converged: YES YES YES YES
title: Mulliken charges:
elementType: C C C C C C C C C C F F F F F F F H Cl
charge: 0.009716 -0.550754 0.170581 -0.097909 0.122109 0.453318 0.323195 -0.191380 0.269103 1.053701 -0.285762 -0.300231 -0.284551 -0.272101 -0.266085 -0.236964 -0.266646 0.346862 -0.996203
chargesum: -1.00000
charge: -0.204589 -0.178044 0.296929 0.094305 0.136158 0.053907 0.308976 -0.429988 0.340421 1.182452 -0.270406 -0.297937 -0.272196 -0.242785 -0.256064 -0.201687 -0.256376 0.159539 -0.962614
dipole: 18.4255 2.7800 -0.0028
dipole: 18.6341
quadrupole: -230.3656 -125.3724 -104.2365
quadrupole: -16.7580 0.0137 0.0017
quadrupole: -77.0408 27.9524 49.0883 -16.7580 0.0137 0.0017
hfenergy: -1539.4046592 hartree
pointgroup: C01 [X(C10H1Cl1F7)]
dipole: -6.1187082 -3.8927928 -1.0743135 debye
InChI: InChI=1/10C.Cl.7F.H
charge -1 multiplicity 1
19 atoms
C  0.25322228 -0.6321842 -0.00077027
C  -0.00808295 0.75801572 0.12618903
C  -1.34248728 1.19976001 0.03562317
C  1.58169831 -1.0685878 0.08976432
C  -0.83034654 -1.5059557 -0.21110941
C  1.08730462 1.61989839 0.33644309
C  -2.35854174 0.32735506 -0.16753338
C  2.59087837 -0.18057618 0.29388843
C  -2.09860853 -1.04011233 -0.29211695
C  2.36706403 1.18648636 0.42221034
F  -1.64597289 2.47396079 0.14524733
F  1.86963124 -2.35462405 -0.02286864
F  -0.63942611 -2.80413716 -0.33525915
F  0.84068837 2.90863996 0.45367921
F  -3.60540539 0.74295488 -0.2518781
F  3.81567756 -0.64408259 0.37054805
F  -3.1093678 -1.85988139 -0.48886792
H  3.21177656 1.88230816 0.58783616
Cl 4.9014769 3.16904506 0.90897469
