program: Gaussian 16
title: 2F_isomer_9 opt
version: ES64L-G16RevC.02
basis: CBSB1
frameworkgroup: C1[X(C10H6F2)]
method: RHF
basis: STO-3G
operation: FOpt
keyword: #P
keyword: opt
keyword: EmpiricalDispersion=GD3BJ
keyword: integral(grid=ultrafinegrid)
keyword: GFInput
keyword: pop=full
keyword: IOP(3/74=-78)
keyword: IOP(6/7=3)
keyword: IOP(3/5=10)
keyword: IOP(3/175=01217700)
keyword: IOP(3/177=414500)
keyword: IOP(3/178=4859300)
keyword: SCF=YQC
title: #P opt EmpiricalDispersion=GD3BJ integral(grid=ultrafinegrid) GFInput
nucrepener: 640.4180357896
basis: NPDir=0 NMtPBC= 1 NCelOv= 1 NCel= 1 NClECP= 1 NCelD= 1
basis: NCelK= 1 NCelE2= 1 NClLst= 1 CellRange= 0.0.
basis: One-electron integrals computed using PRISM.
basis: One-electron integral symmetry used in STVInt
basis: NBasis= 444 RedAO= T EigKep= 1.52D-06 NBF= 444
basis: NBsUse= 442 1.00D-06 EigRej= 6.35D-07 NBFU= 442
converged: YES YES YES YES
title: Mulliken charges:
elementType: C C C C C C C C C C F F H H H H H H
charge: -0.225758 0.577369 -0.013727 -0.488750 -0.219416 -0.193998 -0.179124 -0.083898 0.333888 0.201032 -0.241218 -0.223601 0.135816 0.094472 0.107574 0.126649 0.148140 0.144551
chargesum: 0.00000
charge: -0.186479 0.558538 -0.124269 -0.518949 -0.187457 -0.165712 -0.123730 -0.036579 0.328672 0.152857 -0.229287 -0.210697 0.135979 0.091437 0.101077 0.123888 0.147226 0.143486
chargesum: -0.00000
dipole: 1.1706 -2.2174 -0.0000
dipole: 2.5074
quadrupole: -63.7162 -62.9055 -70.7717
quadrupole: 1.3618 0.0000 -0.0000
quadrupole: 2.0816 2.8923 -4.9739 1.3618 0.0000 -0.0000
hfenergy: -583.6143826 hartree
pointgroup: C01 [X(C10H6F2)]
dipole: 0.3868061 -0.9065484 -0.0413274 debye
InChI: InChI=1/10C.2F.6H
charge 0 multiplicity 1
18 atoms
C  -0.02209226 -0.72658365 0.01025574
C  0.0381692 0.68292855 -0.01191315
C  -1.13306523 1.44747559 0.13331337
C  1.16111757 -1.47557522 -0.13669261
C  -1.27991853 -1.33692911 0.18073896
C  1.30080465 1.27323355 -0.18282156
C  -2.30999545 0.80093155 0.29359762
C  2.35705381 -0.85220008 -0.29922379
C  -2.40775806 -0.59369613 0.32051364
C  2.43477006 0.54925319 -0.32359106
F  1.3607611 2.59780903 -0.20408759
F  -3.42861576 1.49689751 0.43264771
H  -1.09639525 2.5236962 0.11760672
H  1.1018322 -2.55305843 -0.11801924
H  -1.33720223 -2.41469367 0.19915376
H  3.26086324 -1.42984397 -0.41141583
H  -3.37674322 -1.04781901 0.45168515
H  3.37641517 1.05817409 -0.45174684
