program: Gaussian 16
title: 4F_isomer_32 opt
version: ES64L-G16RevC.02
basis: CBSB1
frameworkgroup: C1[X(C10H4F4)]
method: RHF
basis: STO-3G
operation: FOpt
keyword: #P
keyword: opt
keyword: EmpiricalDispersion=GD3BJ
keyword: integral(grid=ultrafinegrid)
keyword: GFInput
keyword: pop=full
keyword: IOP(3/74=-78)
keyword: IOP(6/7=3)
keyword: IOP(3/5=10)
keyword: IOP(3/175=01217700)
keyword: IOP(3/177=414500)
keyword: IOP(3/178=4859300)
keyword: SCF=YQC
title: #P opt EmpiricalDispersion=GD3BJ integral(grid=ultrafinegrid) GFInput
nucrepener: 865.2557530248
basis: NPDir=0 NMtPBC= 1 NCelOv= 1 NCel= 1 NClECP= 1 NCelD= 1
basis: NCelK= 1 NCelE2= 1 NClLst= 1 CellRange= 0.0.
basis: One-electron integrals computed using PRISM.
basis: One-electron integral symmetry used in STVInt
basis: NBasis= 500 RedAO= T EigKep= 1.36D-06 NBF= 500
basis: NBsUse= 498 1.00D-06 EigRej= 5.40D-07 NBFU= 498
converged: YES YES YES YES
title: Mulliken charges:
elementType: C C C C C C C C C C F F F F H H H H
charge: -0.092194 -0.092185 -0.233206 0.172840 -0.233208 0.172847 0.411867 -0.033817 0.411865 -0.033818 -0.247913 -0.247912 -0.231855 -0.231855 0.130739 0.130740 0.123533 0.123533
chargesum: 0.00000
charge: -0.075301 -0.075301 -0.233389 0.129925 -0.233389 0.129925 0.430180 -0.007411 0.430180 -0.007411 -0.250680 -0.250680 -0.239129 -0.239129 0.125806 0.125806 0.119999 0.119999
chargesum: -0.00000
dipole: 3.1435 -0.0000 -0.0000
dipole: 3.1435
quadrupole: -72.0638 -78.1934 -77.3620
quadrupole: 0.0000 0.0000 -0.0000
quadrupole: 3.8092 -2.3203 -1.4889 0.0000 0.0000 -0.0000
hfenergy: -781.8826066 hartree
pointgroup: C01 [X(C10H4F4)]
dipole: 1.232171 0.0830443 0.0665693 debye
InChI: InChI=1/10C.4F.4H
charge 0 multiplicity 1
18 atoms
C  -0.02077992 0.70424789 0.04144467
C  0.07819791 -0.70037791 -0.03834256
C  -1.10029227 -1.45453638 -0.14271274
C  1.15272357 1.47194295 0.14638242
C  -1.29391142 1.29317488 0.01336566
C  1.34828861 -1.30338248 -0.01126509
C  -2.31627469 -0.85806164 -0.16748142
C  2.36708511 0.86182072 0.17024695
C  -2.41473408 0.53920694 -0.08811212
C  2.46559142 -0.53611352 0.09083971
F  -1.02453699 -2.76823893 -0.21817671
F  -1.40313896 2.60462157 0.08702009
F  -3.41990763 -1.55944987 -0.26493026
F  -3.6063142 1.08590531 -0.11466615
H  1.06986687 2.54469864 0.2069555
H  1.4166854 -2.37711273 -0.07261913
H  3.26407931 1.45544669 0.25087039
H  3.43737095 -1.00379015 0.11117779
