program: Gaussian 16
title: 4F_isomer_46 opt
version: ES64L-G16RevC.02
basis: CBSB1
frameworkgroup: C1[X(C10H4F4)]
method: RHF
basis: STO-3G
operation: FOpt
keyword: #P
keyword: opt
keyword: EmpiricalDispersion=GD3BJ
keyword: integral(grid=ultrafinegrid)
keyword: GFInput
keyword: pop=full
keyword: IOP(3/74=-78)
keyword: IOP(6/7=3)
keyword: IOP(3/5=10)
keyword: IOP(3/175=01217700)
keyword: IOP(3/177=414500)
keyword: IOP(3/178=4859300)
keyword: SCF=YQC
title: #P opt EmpiricalDispersion=GD3BJ integral(grid=ultrafinegrid) GFInput
nucrepener: 853.3410559480
basis: NPDir=0 NMtPBC= 1 NCelOv= 1 NCel= 1 NClECP= 1 NCelD= 1
basis: NCelK= 1 NCelE2= 1 NClLst= 1 CellRange= 0.0.
basis: One-electron integrals computed using PRISM.
basis: One-electron integral symmetry used in STVInt
basis: NBasis= 500 RedAO= T EigKep= 1.47D-06 NBF= 500
basis: NBsUse= 498 1.00D-06 EigRej= 6.52D-07 NBFU= 498
converged: YES YES YES YES
title: Mulliken charges:
elementType: C C C C C C C C C C F F F F H H H H
charge: -0.056791 -0.056793 -0.136362 -0.136361 -0.029474 -0.029476 0.314849 0.314850 0.095041 0.095042 -0.248529 -0.248529 -0.227842 -0.227842 0.131158 0.131158 0.157951 0.157951
chargesum: 0.00000
charge: -0.050829 -0.050829 -0.167349 -0.167349 -0.058030 -0.058030 0.332310 0.332310 0.140004 0.140004 -0.247831 -0.247831 -0.227982 -0.227982 0.126877 0.126877 0.152830 0.152830
chargesum: -0.00000
dipole: 0.0000 0.0000 0.0000
dipole: 0.0000
quadrupole: -86.6922 -68.7976 -77.3497
quadrupole: -7.9230 -0.0000 0.0000
quadrupole: -9.0790 8.8156 0.2635 -7.9230 -0.0000 0.0000
hfenergy: -781.8911085 hartree
pointgroup: C01 [X(C10H4F4)]
dipole: 0. 0. 0. debye
InChI: InChI=1/10C.4F.4H
charge 0 multiplicity 1
18 atoms
C  0.04089859 -0.69307124 0.12471528
C  -0.04089858 0.69307134 -0.12471524
C  1.13050758 1.46256686 -0.23892351
C  -1.13050758 -1.46256677 0.23892357
C  -1.31869686 1.25869212 -0.25130582
C  1.31869687 -1.25869202 0.2513058
C  2.34707193 0.87283105 -0.1092426
C  -2.34707192 -0.87283094 0.10924275
C  2.43568892 -0.49840557 0.13765875
C  -2.43568891 0.49840569 -0.13765864
F  -1.42460411 2.55162587 -0.48455308
F  1.42460412 -2.55162573 0.48455331
F  3.62417836 -1.05571509 0.2609839
F  -3.62417836 1.05571521 -0.26098373
H  -1.05158018 -2.51958128 0.42945906
H  1.05158016 2.51958137 -0.42945902
H  3.26228693 1.43686837 -0.19182887
H  -3.26228694 -1.43686823 0.19182907
