program: Gaussian 16
title: Cl2F_isomer_13_0 opt
version: ES64L-G16RevC.02
basis: CBSB1
frameworkgroup: CS[SG(Cl),X(C10H6F2)]
method: RHF
basis: STO-3G
operation: FOpt
keyword: #P
keyword: opt
keyword: EmpiricalDispersion=GD3BJ
keyword: integral(grid=ultrafinegrid)
keyword: GFInput
keyword: pop=full
keyword: IOP(3/74=-78)
keyword: IOP(6/7=3)
keyword: IOP(3/5=10)
keyword: IOP(3/175=01217700)
keyword: IOP(3/177=414500)
keyword: IOP(3/178=4859300)
keyword: SCF=YQC
title: #P opt EmpiricalDispersion=GD3BJ integral(grid=ultrafinegrid) GFInput
nucrepener: 907.7135930516
basis: NPDir=0 NMtPBC= 1 NCelOv= 1 NCel= 1 NClECP= 1 NCelD= 1
basis: NCelK= 1 NCelE2= 1 NClLst= 1 CellRange= 0.0.
basis: One-electron integrals computed using PRISM.
basis: One-electron integral symmetry used in STVInt
basis: NBasis= 498 RedAO= T EigKep= 1.58D-06 NBF= 258 240
basis: NBsUse= 495 1.00D-06 EigRej= 9.20D-07 NBFU= 258 237
converged: YES YES YES YES
title: Mulliken charges:
elementType: C C C C C C C C C C F F H H H H H H Cl
charge: 1.196134 1.196134 -0.422406 -0.539650 -0.422406 -0.539650 0.035148 -0.235229 0.035148 -0.235229 -0.313800 -0.313800 0.129221 0.129221 0.107704 0.076162 0.107704 0.076162 -1.066569
chargesum: -1.00000
charge: 0.408674 0.408674 -0.842681 -0.063200 -0.842681 -0.063200 0.434407 -0.049064 0.434407 -0.049064 -0.254046 -0.254046 0.115214 0.115214 0.134921 0.097259 0.134921 0.097259 -0.962966
dipole: -0.0007 17.7637 0.0000
dipole: 17.7637
quadrupole: -87.9020 -170.2931 -89.9848
quadrupole: 0.0047 0.0000 -0.0000
quadrupole: 28.1579 -54.2332 26.0752 0.0047 0.0000 -0.0000
hfenergy: -1043.7163369 hartree
pointgroup: CS [SG(Cl1),X(C10H6F2)]
dipole: 6.7735199 0.0000002 -1.7211113 debye
InChI: InChI=1/10C.Cl.2F.6H
charge -1 multiplicity 1
19 atoms
C  0.45471627 -0.70601805 0.0268845
C  0.4547162 0.70601806 0.02688439
C  -0.74879251 1.3640136 0.33257935
C  1.64592539 -1.39012263 -0.27562964
C  -0.74879238 -1.36401366 0.33257956
C  1.64592526 1.39012271 -0.27562986
C  -1.88980971 0.70257492 0.6224162
C  2.78374757 -0.70199559 -0.56455205
C  -1.88980964 -0.70257504 0.62241632
C  2.78374751 0.70199572 -0.56455216
F  -0.72698245 2.69876708 0.32701408
F  -0.7269822 -2.69876714 0.32701451
H  1.63737932 -2.46824155 -0.27347735
H  1.63737909 2.46824162 -0.27347774
H  -2.82315857 1.19573989 0.85954521
H  3.69280831 -1.23675428 -0.79540154
H  -2.82315846 -1.19574006 0.8595454
H  3.69280819 1.23675446 -0.79540173
Cl -5.09886853 -0.00000014 1.43805005
