program: Gaussian 16
title: Cl4F_isomer_38_0 opt
version: ES64L-G16RevC.02
basis: CBSB1
frameworkgroup: C1[X(C10H4ClF4)]
method: RHF
basis: STO-3G
operation: FOpt
keyword: #P
keyword: opt
keyword: EmpiricalDispersion=GD3BJ
keyword: integral(grid=ultrafinegrid)
keyword: GFInput
keyword: pop=full
keyword: IOP(3/74=-78)
keyword: IOP(6/7=3)
keyword: IOP(3/5=10)
keyword: IOP(3/175=01217700)
keyword: IOP(3/177=414500)
keyword: IOP(3/178=4859300)
keyword: SCF=YQC
title: #P opt EmpiricalDispersion=GD3BJ integral(grid=ultrafinegrid) GFInput
nucrepener: 1087.3456637418
basis: NPDir=0 NMtPBC= 1 NCelOv= 1 NCel= 1 NClECP= 1 NCelD= 1
basis: NCelK= 1 NCelE2= 1 NClLst= 1 CellRange= 0.0.
basis: One-electron integrals computed using PRISM.
basis: One-electron integral symmetry used in STVInt
basis: NBasis= 554 RedAO= T EigKep= 1.50D-06 NBF= 554
basis: NBsUse= 552 1.00D-06 EigRej= 5.81D-07 NBFU= 552
converged: YES YES YES YES
title: Mulliken charges:
elementType: C C C C C C C C C C F F F F H H H H Cl
charge: -0.443899 0.361180 -0.451231 0.113663 -0.563347 0.509485 -0.472196 0.471581 -0.285699 1.070825 -0.251657 -0.263076 -0.219416 -0.230153 0.089239 0.093376 0.148766 0.336371 -1.013813
chargesum: -1.00000
charge: -0.138360 0.247909 -0.486512 0.287848 -0.426928 0.029448 -0.576933 0.428584 -0.280385 1.248000 -0.237301 -0.231243 -0.189957 -0.222501 0.099973 0.105519 0.161003 0.153692 -0.971857
dipole: -18.8197 -2.9947 0.0007
dipole: 19.0565
quadrupole: -204.2565 -98.3670 -94.4930
quadrupole: -10.9593 0.0039 0.0003
quadrupole: -71.8844 34.0052 37.8792 -10.9593 0.0039 0.0003
hfenergy: -1242.0006466 hartree
pointgroup: C01 [X(C10H4Cl1F4)]
dipole: -6.8502596 -2.8380665 -1.109277 debye
InChI: InChI=1/10C.Cl.4F.4H
charge -1 multiplicity 1
19 atoms
C  -0.0979006 0.44858112 0.12253805
C  -0.11038237 -0.96255175 -0.00266978
C  1.09777186 -1.66711534 0.08749925
C  -1.33332462 1.11440801 0.02556338
C  -1.33031222 -1.63738507 -0.21516244
C  1.14818904 1.08019433 0.33452472
C  2.25167384 -0.98137488 0.29267118
C  -2.50675341 0.46473863 -0.17889413
C  -2.47311641 -0.92389665 -0.29633064
C  2.31923255 0.40576966 0.42269159
F  -1.37673956 2.42877773 0.1352164
F  1.16038536 2.39192201 0.45103915
F  3.37636707 -1.66373149 0.37428073
F  -3.63175542 -1.54653437 -0.49654091
H  1.11591613 -2.74100824 -0.00429636
H  -1.35050329 -2.71069944 -0.31173631
H  -3.43339226 1.00855287 -0.24777634
H  3.27938299 0.91878874 0.58831298
Cl 5.25585531 1.86275313 0.91907048
