program: Gaussian 16
title: Cl4F_isomer_40_1 opt
version: ES64L-G16RevC.02
basis: CBSB1
frameworkgroup: C1[X(C10H4ClF4)]
method: RHF
basis: STO-3G
operation: FOpt
keyword: #P
keyword: opt
keyword: EmpiricalDispersion=GD3BJ
keyword: integral(grid=ultrafinegrid)
keyword: GFInput
keyword: pop=full
keyword: IOP(3/74=-78)
keyword: IOP(6/7=3)
keyword: IOP(3/5=10)
keyword: IOP(3/175=01217700)
keyword: IOP(3/177=414500)
keyword: IOP(3/178=4859300)
keyword: SCF=YQC
title: #P opt EmpiricalDispersion=GD3BJ integral(grid=ultrafinegrid) GFInput
nucrepener: 1095.7613133104
basis: NPDir=0 NMtPBC= 1 NCelOv= 1 NCel= 1 NClECP= 1 NCelD= 1
basis: NCelK= 1 NCelE2= 1 NClLst= 1 CellRange= 0.0.
basis: One-electron integrals computed using PRISM.
basis: One-electron integral symmetry used in STVInt
basis: NBasis= 554 RedAO= T EigKep= 1.30D-06 NBF= 554
basis: NBsUse= 552 1.00D-06 EigRej= 4.49D-07 NBFU= 552
converged: YES YES YES YES
title: Mulliken charges:
elementType: C C C C C C C C C C F F F F H H H H Cl
charge: -0.442901 -0.110963 -0.446267 0.466841 0.066669 -0.026315 0.038045 0.095260 0.389548 0.305840 -0.280115 -0.287890 -0.261682 -0.249193 0.112880 0.233723 0.147520 0.211147 -0.962146
chargesum: -1.00000
charge: 0.010546 0.402983 -0.356469 0.450202 0.082916 -0.400818 0.065673 0.009746 0.256503 -0.039451 -0.266926 -0.255374 -0.250478 -0.244866 0.114684 0.141673 0.161820 0.085134 -0.967499
dipole: -18.5147 1.7991 -0.0003
dipole: 18.6019
quadrupole: -210.6118 -103.8790 -94.4470
quadrupole: 6.9144 -0.0020 0.0003
quadrupole: -74.2992 32.4335 41.8656 6.9144 -0.0020 0.0003
hfenergy: -1241.9978476 hartree
pointgroup: C01 [X(C10H4Cl1F4)]
dipole: 6.07554 -3.950519 -1.0210569 debye
InChI: InChI=1/10C.Cl.4F.4H
charge -1 multiplicity 1
19 atoms
C  -0.5496003 -0.38853082 0.04966012
C  0.1985515 0.8149518 0.08008485
C  1.59314402 0.74226984 -0.07716226
C  -1.94650924 -0.28054563 0.2104185
C  0.15344945 -1.59266126 -0.13745222
C  -0.45496916 2.04499772 0.26430503
C  2.21864422 -0.44324342 -0.2541705
C  -2.56750873 0.9067876 0.38717498
C  1.49912628 -1.63738177 -0.28680897
C  -1.80663586 2.08335303 0.41380023
F  2.30484875 1.85887382 -0.05082586
F  -2.666394 -1.39409699 0.18516227
F  -0.50684485 -2.73882539 -0.17199638
F  3.53473083 -0.48921515 -0.40044585
H  0.13154664 2.94839909 0.28445533
H  -3.63841315 0.99349653 0.51079223
H  2.0084196 -2.57560038 -0.42839939
H  -2.36286968 3.00027212 0.55863668
Cl -4.89820184 3.32904026 0.86277118
