program: Gaussian 16
title: Cl4F_isomer_47_0 opt
version: ES64L-G16RevC.02
basis: CBSB1
frameworkgroup: C1[X(C10H4ClF4)]
method: RHF
basis: STO-3G
operation: FOpt
keyword: #P
keyword: opt
keyword: EmpiricalDispersion=GD3BJ
keyword: integral(grid=ultrafinegrid)
keyword: GFInput
keyword: pop=full
keyword: IOP(3/74=-78)
keyword: IOP(6/7=3)
keyword: IOP(3/5=10)
keyword: IOP(3/175=01217700)
keyword: IOP(3/177=414500)
keyword: IOP(3/178=4859300)
keyword: SCF=YQC
title: #P opt EmpiricalDispersion=GD3BJ integral(grid=ultrafinegrid) GFInput
nucrepener: 1164.3878622161
basis: NPDir=0 NMtPBC= 1 NCelOv= 1 NCel= 1 NClECP= 1 NCelD= 1
basis: NCelK= 1 NCelE2= 1 NClLst= 1 CellRange= 0.0.
basis: One-electron integrals computed using PRISM.
basis: One-electron integral symmetry used in STVInt
basis: NBasis= 554 RedAO= T EigKep= 1.06D-06 NBF= 554
basis: NBsUse= 552 1.00D-06 EigRej= 5.58D-07 NBFU= 552
converged: YES YES YES YES
title: Mulliken charges:
elementType: C C C C C C C C C C F F F F H H H H Cl
charge: 0.607195 -0.246033 0.061964 -0.204464 0.565803 -0.579257 0.260405 0.152639 0.121291 -0.002685 -0.275043 -0.310385 -0.268019 -0.281469 0.132233 0.101451 0.118805 0.114451 -1.068882
chargesum: -1.00000
charge: -0.171494 -0.156415 0.254007 -0.140252 0.281972 -0.319651 0.626405 -0.213323 0.221141 0.078596 -0.266780 -0.287707 -0.230252 -0.236194 0.111618 0.141596 0.132319 0.136864 -0.962448
dipole: -17.0933 -0.1583 -0.0335
dipole: 17.0941
quadrupole: -185.2044 -104.1335 -94.4425
quadrupole: -17.9170 -0.1589 -0.0028
quadrupole: -57.2776 23.7933 33.4843 -17.9170 -0.1589 -0.0028
hfenergy: -1241.9969111 hartree
pointgroup: C01 [X(C10H4Cl1F4)]
dipole: 2.3111205 5.9882307 -2.0074281 debye
InChI: InChI=1/10C.Cl.4F.4H
charge -1 multiplicity 1
19 atoms
C  -0.00317337 0.6087663 -0.22585042
C  0.66007776 -0.54638542 0.26096533
C  -0.07360916 -1.69060252 0.61060696
C  0.7808338 1.73107847 -0.56205312
C  -1.39970413 0.55111615 -0.33817673
C  2.06228852 -0.49450101 0.37614746
C  -1.42778485 -1.7086127 0.48741272
C  2.12598297 1.73627051 -0.43517949
C  -2.07755763 -0.57599244 0.00984533
C  2.78829293 0.5959449 0.04606737
F  0.18232055 2.82530457 -1.02038042
F  -2.08237402 1.59336456 -0.78501827
F  2.68352508 -1.57143725 0.83018107
F  -3.39383291 -0.57743164 -0.11549556
H  0.40643633 -2.58173064 0.9848638
H  -1.95684685 -2.61350301 0.7706325
H  2.67422165 2.62345466 -0.70780371
H  3.86024943 0.57863796 0.1550296
Cl -1.25800175 -4.78869997 1.65820557
