program: Gaussian 16
title: Cl6F_isomer_65_1 opt
version: ES64L-G16RevC.02
basis: CBSB1
frameworkgroup: C1[X(C10H2ClF6)]
method: RHF
basis: STO-3G
operation: FOpt
keyword: #P
keyword: opt
keyword: EmpiricalDispersion=GD3BJ
keyword: integral(grid=ultrafinegrid)
keyword: GFInput
keyword: pop=full
keyword: IOP(3/74=-78)
keyword: IOP(6/7=3)
keyword: IOP(3/5=10)
keyword: IOP(3/175=01217700)
keyword: IOP(3/177=414500)
keyword: IOP(3/178=4859300)
keyword: SCF=YQC
title: #P opt EmpiricalDispersion=GD3BJ integral(grid=ultrafinegrid) GFInput
nucrepener: 1402.9735247899
basis: NPDir=0 NMtPBC= 1 NCelOv= 1 NCel= 1 NClECP= 1 NCelD= 1
basis: NCelK= 1 NCelE2= 1 NClLst= 1 CellRange= 0.0.
basis: One-electron integrals computed using PRISM.
basis: One-electron integral symmetry used in STVInt
basis: NBasis= 610 RedAO= T EigKep= 1.33D-06 NBF= 610
basis: NBsUse= 608 1.00D-06 EigRej= 5.18D-07 NBFU= 608
converged: YES YES YES YES
title: Mulliken charges:
elementType: C C C C C C C C C C F F F F F F H H Cl
charge: -0.099748 0.186573 0.208318 0.080088 -0.418187 -0.046648 0.396721 0.895350 0.028466 -0.063244 -0.294025 -0.279617 -0.316307 -0.285333 -0.252360 -0.264935 0.121482 0.272820 -0.869414
chargesum: -1.00000
charge: 0.273087 -0.298740 0.288434 -0.233017 -0.240017 -0.000430 0.483299 1.221331 0.189025 -0.516287 -0.228984 -0.261485 -0.301816 -0.264616 -0.237592 -0.204902 0.138706 0.157886 -0.963881
dipole: -18.1787 1.8717 -0.0023
dipole: 18.2748
quadrupole: -227.6674 -115.7913 -100.9117
quadrupole: 17.5759 -0.0105 0.0017
quadrupole: -79.5439 32.3322 47.2117 17.5759 -0.0105 0.0017
hfenergy: -1440.2740019 hartree
pointgroup: C01 [X(C10H2Cl1F6)]
dipole: 6.3999462 -3.0052944 -1.3050294 debye
InChI: InChI=1/10C.Cl.6F.2H
charge -1 multiplicity 1
19 atoms
C  0.04580191 0.87927456 0.14119699
C  -0.04920675 -0.52001568 -0.04050098
C  1.14261453 -1.22020744 -0.30277878
C  -1.13579952 1.59247921 0.40386621
C  1.29057468 1.52958757 0.05963936
C  -1.31338768 -1.11938583 0.05083326
C  2.33558799 -0.57882181 -0.37841428
C  -2.35603351 1.01588993 0.49227994
C  2.40060002 0.80697955 -0.1944477
C  -2.41539967 -0.36532933 0.30818985
F  -1.00749113 2.89865883 0.56798109
F  1.13178394 -2.52498496 -0.48294533
F  -1.44647804 -2.42609746 -0.11270958
F  3.44254298 -1.25076992 -0.62502574
F  3.59230772 1.37392511 -0.28027245
F  -3.5775641 -0.97380821 0.38415252
H  1.35489543 2.59506995 0.19911226
H  -3.27032896 1.60112864 0.70031726
Cl -5.04558486 2.76887929 1.10952409
