program: Gaussian 16
title: Cl6F_isomer_68_0 opt
version: ES64L-G16RevC.02
basis: CBSB1
frameworkgroup: C1[X(C10H2ClF6)]
method: RHF
basis: STO-3G
operation: FOpt
keyword: #P
keyword: opt
keyword: EmpiricalDispersion=GD3BJ
keyword: integral(grid=ultrafinegrid)
keyword: GFInput
keyword: pop=full
keyword: IOP(3/74=-78)
keyword: IOP(6/7=3)
keyword: IOP(3/5=10)
keyword: IOP(3/175=01217700)
keyword: IOP(3/177=414500)
keyword: IOP(3/178=4859300)
keyword: SCF=YQC
title: #P opt EmpiricalDispersion=GD3BJ integral(grid=ultrafinegrid) GFInput
nucrepener: 1443.6699408753
basis: NPDir=0 NMtPBC= 1 NCelOv= 1 NCel= 1 NClECP= 1 NCelD= 1
basis: NCelK= 1 NCelE2= 1 NClLst= 1 CellRange= 0.0.
basis: One-electron integrals computed using PRISM.
basis: One-electron integral symmetry used in STVInt
basis: NBasis= 610 RedAO= T EigKep= 1.15D-06 NBF= 610
basis: NBsUse= 608 1.00D-06 EigRej= 5.51D-07 NBFU= 608
converged: YES YES YES YES
title: Mulliken charges:
elementType: C C C C C C C C C C F F F F F F H H Cl
charge: 0.129522 0.412036 -0.131580 0.181619 0.319625 -0.406745 0.449039 0.325902 0.501720 -0.278522 -0.309587 -0.262367 -0.312475 -0.292617 -0.292461 -0.232894 0.128150 0.144755 -1.073121
chargesum: -1.00000
charge: -0.098940 0.405933 -0.175995 0.349105 0.228189 -0.323318 0.420583 0.336475 0.378882 -0.288998 -0.269475 -0.248485 -0.278792 -0.256067 -0.256644 -0.230495 0.142315 0.154103 -0.988376
dipole: -2.5537 0.6461 -10.5233
dipole: 10.8480
quadrupole: -114.3753 -111.8546 -136.2454
quadrupole: -1.6535 -4.6202 3.0039
quadrupole: 6.4498 8.9705 -15.4203 -1.6535 -4.6202 3.0039
hfenergy: -1440.2685419 hartree
pointgroup: C01 [X(C10H2Cl1F6)]
dipole: -0.9431426 0.076534 -4.1617155 debye
InChI: InChI=1/10C.Cl.6F.2H
charge -1 multiplicity 1
19 atoms
C  -0.28223273 0.64315727 -0.08691456
C  -0.3445168 -0.76700899 -0.08585588
C  0.85317528 -1.48923912 -0.10659539
C  -1.50420897 1.33196768 -0.03691561
C  0.97454267 1.26678749 -0.09686489
C  -1.57925271 -1.4337967 -0.04589933
C  2.05004093 -0.86340546 -0.11876254
C  -2.69971958 0.69757979 0.00661413
C  2.10992275 0.53204965 -0.11380136
C  -2.70737969 -0.6955361 0.00289929
F  0.81254385 -2.80973536 -0.10547802
F  -1.50155346 2.6531358 -0.03369922
F  1.08047638 2.5795412 -0.08960232
F  3.17593346 -1.54249824 -0.12814252
F  3.29228712 1.1117413 -0.11907445
F  -3.89289123 -1.29648208 0.04975364
H  -1.61889821 -2.50823764 -0.01715452
H  -3.61743105 1.25803812 0.0598885
Cl 0.43818816 -0.16795262 3.06560604
