program: Gaussian 16
title: Cl6F_isomer_71_1 opt
version: ES64L-G16RevC.02
basis: CBSB1
frameworkgroup: CS[SG(C10H2ClF6)]
method: RHF
basis: STO-3G
operation: FOpt
keyword: #P
keyword: opt
keyword: EmpiricalDispersion=GD3BJ
keyword: integral(grid=ultrafinegrid)
keyword: GFInput
keyword: pop=full
keyword: IOP(3/74=-78)
keyword: IOP(6/7=3)
keyword: IOP(3/5=10)
keyword: IOP(3/175=01217700)
keyword: IOP(3/177=414500)
keyword: IOP(3/178=4859300)
keyword: SCF=YQC
title: #P opt EmpiricalDispersion=GD3BJ integral(grid=ultrafinegrid) GFInput
nucrepener: 1374.8404677378
basis: NPDir=0 NMtPBC= 1 NCelOv= 1 NCel= 1 NClECP= 1 NCelD= 1
basis: NCelK= 1 NCelE2= 1 NClLst= 1 CellRange= 0.0.
basis: One-electron integrals computed using PRISM.
basis: One-electron integral symmetry used in STVInt
basis: NBasis= 610 RedAO= T EigKep= 1.11D-06 NBF= 414 196
basis: NBsUse= 607 1.00D-06 EigRej= 5.05D-07 NBFU= 411 196
converged: YES YES YES YES
title: Mulliken charges:
elementType: C C C C C C C C C C F F F F F F H H Cl
charge: 0.217905 0.039660 -0.582800 0.306277 -0.133352 1.076319 -0.021967 -0.229164 0.292691 -0.406336 -0.195667 -0.286688 -0.243138 -0.271890 -0.292106 -0.266426 0.117816 0.213930 -0.335064
chargesum: -1.00000
charge: 0.373049 0.243037 -0.623706 0.178156 -0.319395 0.785708 0.119521 0.023485 0.222501 0.124090 -0.187795 -0.286441 -0.238068 -0.255711 -0.218946 -0.256963 0.136785 0.136924 -0.956233
dipole: 10.9066 -12.2495 0.0000
dipole: 16.4013
quadrupole: -157.8402 -154.4182 -101.0187
quadrupole: 36.9010 0.0000 0.0000
quadrupole: -20.0812 -16.6592 36.7404 36.9010 0.0000 0.0000
hfenergy: -1440.2695143 hartree
pointgroup: CS [SG(C10H2Cl1F6)]
dipole: 2.2466263 -6.0490339 0. debye
InChI: InChI=1/10C.Cl.6F.2H
charge -1 multiplicity 1
19 atoms
C  -0.1512904 -0.76640534 0.0000
C  -0.16628708 0.64688722 0.0000
C  1.06752728 1.32556803 0.0000
C  -1.36546892 -1.47195465 0.0000
C  1.07893278 -1.43747152 0.0000
C  -1.38826895 1.34947217 0.0000
C  2.24081387 0.64302483 0.0000
C  -2.52169129 -0.77288773 0.0000
C  2.24808523 -0.75689499 0.0000
C  -2.53469238 0.62955362 0.0000
F  1.09750135 2.62986849 0.0000
F  1.09842612 -2.76285439 0.0000
F  -3.68267403 -1.40612893 0.0000
F  3.39860887 1.27223827 0.0000
F  -3.71458105 1.20924612 0.0000
F  3.40657444 -1.38581116 0.0000
H  -1.38269165 -2.54855183 0.0000
H  -1.4360255 2.44980932 0.0000
Cl -1.80366569 4.62969048 0.0000
