program: Gaussian 09
title: 000075385
version: EM64L-G09RevD.01
frameworkgroup: C1[X(C6H16Cl2OSi2)]
method: RPBEPBE
basis: SDD
operation: Freq
keyword: #p
keyword: freq=noraman
keyword: PBEPBE/SDD
title: #p freq=noraman PBEPBE/SDD
converged: NO NO NO NO
title: Mulliken charges:
elementType: Cl Cl Si Si O C C C C C C H H H H H H H H H H H H H H H H
charge: -0.089030 -0.089038 1.536247 1.536229 -1.016152 -0.886288 -0.886317 -1.040084 -1.032732 -1.039942 -1.032678 0.269930 0.276576 0.269994 0.276601 0.236630 0.233027 0.265687 0.230838 0.258905 0.248264 0.233006 0.265610 0.236712 0.248308 0.230833 0.258865
chargesum: 0.00000
title: Mulliken charges with hydrogens summed into heavy atoms:
elementType: Cl Cl Si Si O C C C C C C
charge: -0.089030 -0.089038 1.536247 1.536229 -1.016152 -0.339782 -0.339722 -0.304739 -0.294725 -0.304615 -0.294672
polarizability: 1.26814897e+02 8.58301103e+00 1.41932667e+02 1.85563518e-02 -3.83029002e-03 1.17684689e+02
1716.lowfreq: -6.6745 -2.8234 -0.0026 -0.0009 0.0010 6.2615 12.6276 15.5605 22.0633
frequency: 3.8843 14.6553 21.8230 42.7370 70.5106 102.1292 114.4603 125.8627 126.1782 142.6474 142.7396 160.5363 169.5292 174.9452 189.9414 203.5645 224.7228 233.1645 285.8829 300.0836 334.0343 434.3671 569.7616 587.1151 630.0147 648.9300 701.1467 701.2941 708.9101 711.5971 739.9006 742.2564 812.1202 812.9442 837.6437 845.5429 883.4993 910.7676 915.8507 921.2831 1077.4564 1087.5807 1089.7596 1186.8924 1187.4244 1300.9171 1301.3260 1308.1414 1310.2174 1408.8740 1409.1698 1440.5897 1440.8913 1444.5595 1447.3207 1448.8591 1450.3594 1456.4766 1458.2623 2982.7225 2982.8205 2987.5448 2987.7254 3034.8434 3034.9223 3087.4359 3087.7246 3089.0901 3089.3775 3091.0178 3091.3011 3100.9161 3101.0888 3118.3825 3118.5111
redmass: 5.5376 7.7445 3.5990 8.2367 3.2101 4.2916 3.4680 1.0358 1.0456 1.0335 1.0212 2.4795 2.3968 3.1039 3.0243 3.2804 2.5934 4.0127 4.3746 5.1955 5.3882 4.6572 4.8564 5.1804 4.4199 3.4470 3.1376 3.0424 2.3464 2.4191 1.6495 1.6371 1.2748 1.2793 1.8259 1.8607 1.4418 1.5307 1.5360 1.6422 4.5524 1.2296 1.0448 1.1917 1.1834 1.2067 1.2057 1.1962 1.1961 1.0807 1.0805 1.0507 1.0509 1.0528 1.0531 1.0491 1.0481 1.0484 1.0478 1.0343 1.0343 1.0346 1.0345 1.0559 1.0559 1.0984 1.0983 1.0982 1.0981 1.0980 1.0977 1.0986 1.0986 1.1074 1.1074
irintensity: 0.0400 4.1884 3.4744 0.5726 2.5660 1.8178 0.8310 0.0199 0.0203 0.1226 0.0110 0.0061 0.0404 0.9553 0.0088 0.8002 3.2053 4.9434 28.9327 8.8951 61.4133 0.0863 13.5079 0.0032 35.4589 0.0103 5.3787 1.4812 17.7933 7.3970 15.6259 6.0695 0.6302 4.3360 14.5734 146.1050 211.4698 49.9015 206.7125 0.2114 512.7139 172.0168 3.8077 11.4874 3.9622 23.2069 79.7129 56.7689 21.6674 18.4303 8.4956 0.6409 7.3991 2.6020 0.3521 4.9981 12.8798 33.5394 0.6143 11.5292 9.4418 8.4477 8.7417 12.0887 16.8110 3.3060 11.7591 19.7452 5.1497 35.8562 7.6128 0.8736 14.7229 15.0274 5.2030
temp: 298.150 k
press: 1.00000 atm
elementType: 17 17 14 14 8 6 6 6 6 6 6 1 1 1 1 1 1 1 1 1 1 1 1 1 1 1 1
symmnumber: 1
zpe: 547527.7 jmol-1
zpe.correction: 0.208542 hartree
zpe.thermalcorrener: 0.227374 hartree
zpe.thermalcorrenthalpy: 0.228318 hartree
zpe.thermalcorrgfe: 0.156295 hartree
zpe.sumelectzpe: -1811.553691 hartree
zpe.sumelectthermal: -1811.534859 hartree
zpe.sumelectthermalent: -1811.533915 hartree
zpe.sumelectthermalfe: -1811.605938 hartree
dipole: -0.0143 0.0017 -1.3679
dipole: 1.3680
quadrupole: -104.4023 -95.2629 -93.5611
quadrupole: -14.1467 -0.0004 0.0008
quadrupole: -6.6602 2.4792 4.1810 -14.1467 -0.0004 0.0008
hfenergy: -1811.762233 hartree
pointgroup: C01 [X(C6H16Cl2O1Si2)]
dipole: 0.0056424 -0.000665 0.5381711 debye
polarizability: 123.737001|-4.2028213|145.0105635|0.0189374|-0.000619|117.6846894 unknown
InChI: InChI=1S/C6H16Cl2OSi2/c1-10(2,5-7)9-11(3,4)6-8/h5-6H2,1-4H3
charge 0 multiplicity 1
27 atoms
Cl -2.916448 2.004936 0.086542
Cl 2.905752 -2.008172 0.086588
Si -1.494346 -0.802088 0.075803
Si 1.493736 0.803873 0.075551
O  -0.001625 0.0033 0.074764
C  -2.746013 0.34019 0.988999
C  2.741331 -0.342707 0.988789
C  -1.33014 -2.417918 1.073318
C  -2.057344 -1.100354 -1.712274
C  1.335447 2.420521 1.072821
C  2.057648 1.099783 -1.712633
H  -3.765539 -0.078779 1.026849
H  -2.415496 0.594775 2.009293
H  3.762285 0.072768 1.026473
H  2.409989 -0.595937 2.009156
H  -1.176331 -2.217135 2.149231
H  -2.226178 -3.056598 0.965682
H  -0.453946 -2.985106 0.709411
H  -3.006876 -1.665922 -1.747253
H  -2.209775 -0.137213 -2.23023
H  -1.293968 -1.675647 -2.266304
H  2.233871 3.055856 0.965181
H  0.461387 2.990948 0.708777
H  1.18087 2.220432 2.148763
H  1.296239 1.677633 -2.266738
H  3.009138 1.662052 -1.747767
H  2.206731 0.136008 -2.230391
